null
SMILES: Cc1cc(F)ccc1Oc1ccc(cc1C(=O)Nc1ccc(cc1)C(O)=O)C(F)(F)F
InChI Key: InChIKey=ZWSJDCCDISWMKX-UHFFFAOYSA-N
Activity Spreadsheet -- Enzyme Inhibition Constant Data from BindingDB
Found 2 hits for monomerid = 160963
Trg + Lig
Ki
nM
ΔG°
kcal/mole
IC50
nM
Kd
nM
EC50/IC50
nM
koff
s-1
kon
M-1s-1
pHTemp
°C
Sodium channel protein type 10 subunit alpha
(Rattus norvegicus (Rat))
BDBM160963
(US9108903, 28 | US9108903, 29)
Show SMILES Cc1cc(F)ccc1Oc1ccc(cc1C(=O)Nc1ccc(cc1)C(O)=O)C(F)(F)F
Show InChI InChI=1S/C22H15F4NO4/c1-12-10-15(23)5-9-18(12)31-19-8-4-14(22(24,25)26)11-17(19)20(28)27-16-6-2-13(3-7-16)21(29)30/h2-11H,1H3,(H,27,28)(H,29,30)
US Patent
n/an/a 245n/an/an/an/an/an/a
VERTEX PHARMACEUTICALS INCORPORATED
US Patent
Assay Description
Patch clamp electrophysiology was used to assess the efficacy and selectivity of sodium channel blockers in dorsal root ganglion neurons. Rat neurons...
US Patent US9108903 (2015)
BindingDB Entry DOI: 10.7270/Q23J3BP9
Sodium channel protein type 10 subunit alpha
(Rattus norvegicus (Rat))
BDBM160963
(US9108903, 28 | US9108903, 29)
Show SMILES Cc1cc(F)ccc1Oc1ccc(cc1C(=O)Nc1ccc(cc1)C(O)=O)C(F)(F)F
Show InChI InChI=1S/C22H15F4NO4/c1-12-10-15(23)5-9-18(12)31-19-8-4-14(22(24,25)26)11-17(19)20(28)27-16-6-2-13(3-7-16)21(29)30/h2-11H,1H3,(H,27,28)(H,29,30)
US Patent
n/an/a 340n/an/an/an/an/an/a
VERTEX PHARMACEUTICALS INCORPORATED
US Patent
Assay Description
Patch clamp electrophysiology was used to assess the efficacy and selectivity of sodium channel blockers in dorsal root ganglion neurons. Rat neurons...
US Patent US9108903 (2015)
BindingDB Entry DOI: 10.7270/Q23J3BP9