BDBM161111 US9051265, 17
SMILES: C[C@@H](NC(=O)c1ccc2n(Cc3ccc(F)cc3F)ccc2c1)c1ccc(F)cc1
InChI Key: InChIKey=BZCVWUCLNMTRBT-OAHLLOKOSA-N
Data: 1 IC50
Activity Spreadsheet -- Enzyme Inhibition Constant Data from BindingDB
Found 1 hit for monomerid = 161111
Trg + Lig
Ki
nM
ΔG°
kcal/mole
IC50
nM
Kd
nM
EC50/IC50
nM
koff
s-1
kon
M-1s-1
pHTemp
°C
Peroxisome proliferator-activated receptor
(Homo sapiens (Human))
BDBM161111
(US9051265, 17)
Show SMILES C[C@@H](NC(=O)c1ccc2n(Cc3ccc(F)cc3F)ccc2c1)c1ccc(F)cc1 |r|
Show InChI InChI=1S/C24H19F3N2O/c1-15(16-2-6-20(25)7-3-16)28-24(30)18-5-9-23-17(12-18)10-11-29(23)14-19-4-8-21(26)13-22(19)27/h2-13,15H,14H2,1H3,(H,28,30)/t15-/m1/s1
NCI pathway
Reactome pathway
US Patent
n/an/a<1n/an/an/an/an/an/a
The Scripps Research Institute
US Patent
Assay Description
The assay was performed according to manufacturer protocol. A mixture of 5 nM GST-PPARG-LBD, 5 nM Tb-GST-antibody, 5 nM Fluormone Pan- PPAR Green, an...
US Patent US9051265 (2015)
BindingDB Entry DOI: 10.7270/Q2FT8JSW