BDBM161153 US9051265, 61
SMILES: CC(C)c1cccc(c1)[C@H](C)NC(=O)c1ccc2n(Cc3cc(O[C@@H](C)C(O)=O)ccc3Cl)c(C)c(C)c2c1
InChI Key: InChIKey=RBPPDBMDXPPKBU-UNMCSNQZSA-N
Data: 1 IC50
Activity Spreadsheet -- Enzyme Inhibition Constant Data from BindingDB
Found 1 hit for monomerid = 161153
Trg + Lig
Ki
nM
ΔG°
kcal/mole
IC50
nM
Kd
nM
EC50/IC50
nM
koff
s-1
kon
M-1s-1
pHTemp
°C
Peroxisome proliferator-activated receptor
(Homo sapiens (Human))
BDBM161153
(US9051265, 61)
Show SMILES CC(C)c1cccc(c1)[C@H](C)NC(=O)c1ccc2n(Cc3cc(O[C@@H](C)C(O)=O)ccc3Cl)c(C)c(C)c2c1 |r|
Show InChI InChI=1S/C32H35ClN2O4/c1-18(2)23-8-7-9-24(14-23)20(4)34-31(36)25-10-13-30-28(16-25)19(3)21(5)35(30)17-26-15-27(11-12-29(26)33)39-22(6)32(37)38/h7-16,18,20,22H,17H2,1-6H3,(H,34,36)(H,37,38)/t20-,22-/m0/s1
NCI pathway
Reactome pathway
US Patent
n/an/a 0.0600n/an/an/an/an/an/a
The Scripps Research Institute
US Patent
Assay Description
The assay was performed according to manufacturer protocol. A mixture of 5 nM GST-PPARG-LBD, 5 nM Tb-GST-antibody, 5 nM Fluormone Pan- PPAR Green, an...
US Patent US9051265 (2015)
BindingDB Entry DOI: 10.7270/Q2FT8JSW