BDBM161492 US9108983, Example 23
SMILES: C[C@@H]1Cc2ccccc2CN1C(=O)c1cc2OCOc2cc1-c1cc(C(=O)N(c2cnn(C)c2)c2ccc(O)cc2)c(C)n1CCO
InChI Key: InChIKey=RDSBRNAZFJLKHC-JOCHJYFZSA-N
Data: 1 IC50
Activity Spreadsheet -- Enzyme Inhibition Constant Data from BindingDB
Found 1 hit for monomerid = 161492
Trg + Lig
Ki
nM
ΔG°
kcal/mole
IC50
nM
Kd
nM
EC50/IC50
nM
koff
s-1
kon
M-1s-1
pHTemp
°C
Apoptosis regulator Bcl-2
(Homo sapiens (Human))
BDBM161492
(US9108983, Example 23)
Show SMILES C[C@@H]1Cc2ccccc2CN1C(=O)c1cc2OCOc2cc1-c1cc(C(=O)N(c2cnn(C)c2)c2ccc(O)cc2)c(C)n1CCO
Show InChI InChI=1S/C36H35N5O6/c1-22-14-24-6-4-5-7-25(24)19-40(22)35(44)31-17-34-33(46-21-47-34)16-30(31)32-15-29(23(2)39(32)12-13-42)36(45)41(27-18-37-38(3)20-27)26-8-10-28(43)11-9-26/h4-11,15-18,20,22,42-43H,12-14,19,21H2,1-3H3/t22-/m1/s1
US Patent
n/an/a 3.60n/an/an/an/a7.4n/a
LES LABORATOIRES SERVIER; VERNALIS (R&D) LTD
US Patent
Assay Description
The fluorescence polarisation tests were carried out on microplates (384 wells). The Bcl-2 protein, labelled (histag-Bcl-2 such that Bcl-2 correspond...
US Patent US9108983 (2015)
BindingDB Entry DOI: 10.7270/Q2PC314Z