null
SMILES: Cc1c(cc(C#N)n1C)N(C(=O)c1cc(-c2cc3OCCOc3cc2C(=O)N2Cc3ccccc3C[C@H]2CN2CCOCC2)n(C)c1C)c1ccc(O)cc1
InChI Key: InChIKey=VOTWMWZEFASSLY-XIFFEERXSA-N
Activity Spreadsheet -- Enzyme Inhibition Constant Data from BindingDB
Found 1 hit for monomerid = 161597
Trg + Lig
Ki
nM
ΔG°
kcal/mole
IC50
nM
Kd
nM
EC50/IC50
nM
koff
s-1
kon
M-1s-1
pHTemp
°C
Apoptosis regulator Bcl-2
(Homo sapiens (Human))
BDBM161597
(US9108983, Example 413)
Show SMILES Cc1c(cc(C#N)n1C)N(C(=O)c1cc(-c2cc3OCCOc3cc2C(=O)N2Cc3ccccc3C[C@H]2CN2CCOCC2)n(C)c1C)c1ccc(O)cc1
Show InChI InChI=1S/C43H44N6O6/c1-27-35(43(52)49(31-9-11-34(50)12-10-31)38-20-32(24-44)45(3)28(38)2)21-39(46(27)4)36-22-40-41(55-18-17-54-40)23-37(36)42(51)48-25-30-8-6-5-7-29(30)19-33(48)26-47-13-15-53-16-14-47/h5-12,20-23,33,50H,13-19,25-26H2,1-4H3/t33-/m0/s1
US Patent
n/an/a 3.10n/an/an/an/a7.4n/a
LES LABORATOIRES SERVIER; VERNALIS (R&D) LTD
US Patent
Assay Description
The fluorescence polarisation tests were carried out on microplates (384 wells). The Bcl-2 protein, labelled (histag-Bcl-2 such that Bcl-2 correspond...
US Patent US9108983 (2015)
BindingDB Entry DOI: 10.7270/Q2PC314Z