BDBM161876 US9051279, 47
SMILES: CC[C@@H](C)Oc1cc2C(N(C(=O)Cc2cc1OC)c1ccc(cc1)N(C)CC1CCNCC1)c1ccc(Cl)cc1
InChI Key: InChIKey=NCDHHXTYFKEITD-LWMFVPLKSA-N
Data: 2 IC50
Activity Spreadsheet -- Enzyme Inhibition Constant Data from BindingDB
Found 2 hits for monomerid = 161876
Trg + Lig
Ki
nM
ΔG°
kcal/mole
IC50
nM
Kd
nM
EC50/IC50
nM
koff
s-1
kon
M-1s-1
pHTemp
°C
p53-Binding Protein HDMX
(Homo sapiens (Human))
BDBM161876
(US9051279, 47)
Show SMILES CC[C@@H](C)Oc1cc2C(N(C(=O)Cc2cc1OC)c1ccc(cc1)N(C)CC1CCNCC1)c1ccc(Cl)cc1 |r|
Show InChI InChI=1S/C33H40ClN3O3/c1-5-22(2)40-31-20-29-25(18-30(31)39-4)19-32(38)37(33(29)24-6-8-26(34)9-7-24)28-12-10-27(11-13-28)36(3)21-23-14-16-35-17-15-23/h6-13,18,20,22-23,33,35H,5,14-17,19,21H2,1-4H3/t22-,33?/m1/s1
NCI pathway
US Patent
n/an/a 4.06E+3n/an/an/an/an/an/a
Novartis AG
US Patent
Assay Description
The inhibition of p53-Hdm2 and p53-Hdm4 interactions is measured by time resolved fluorescence energy transfer (TR-FRET). Fluorescence energy transfe...
US Patent US9051279 (2015)
BindingDB Entry DOI: 10.7270/Q2DV1HMM
E3 ubiquitin-protein ligase Mdm2
(Homo sapiens (Human))
BDBM161876
(US9051279, 47)
Show SMILES CC[C@@H](C)Oc1cc2C(N(C(=O)Cc2cc1OC)c1ccc(cc1)N(C)CC1CCNCC1)c1ccc(Cl)cc1 |r|
Show InChI InChI=1S/C33H40ClN3O3/c1-5-22(2)40-31-20-29-25(18-30(31)39-4)19-32(38)37(33(29)24-6-8-26(34)9-7-24)28-12-10-27(11-13-28)36(3)21-23-14-16-35-17-15-23/h6-13,18,20,22-23,33,35H,5,14-17,19,21H2,1-4H3/t22-,33?/m1/s1
NCI pathway
Reactome pathway
US Patent
n/an/a 3.5n/an/an/an/an/an/a
Novartis AG
US Patent
Assay Description
The inhibition of p53-Hdm2 and p53-Hdm4 interactions is measured by time resolved fluorescence energy transfer (TR-FRET). Fluorescence energy transfe...
US Patent US9051279 (2015)
BindingDB Entry DOI: 10.7270/Q2DV1HMM