BDBM161966 US9051279, 70
SMILES: CC[C@@H](C)Oc1cc2C(N(C(=O)Cc2cc1OC)c1ccc(cc1)C(C)N1CCN(CC1)C(C)=O)c1ccc(Cl)cc1
InChI Key: InChIKey=OXJJQMUURYIRHE-MHJPDIQUSA-N
Data: 2 IC50
Activity Spreadsheet -- Enzyme Inhibition Constant Data from BindingDB
Found 2 hits for monomerid = 161966
Trg + Lig
Ki
nM
ΔG°
kcal/mole
IC50
nM
Kd
nM
EC50/IC50
nM
koff
s-1
kon
M-1s-1
pHTemp
°C
p53-Binding Protein HDMX
(Homo sapiens (Human))
BDBM161966
(US9051279, 70)
Show SMILES CC[C@@H](C)Oc1cc2C(N(C(=O)Cc2cc1OC)c1ccc(cc1)C(C)N1CCN(CC1)C(C)=O)c1ccc(Cl)cc1 |r|
Show InChI InChI=1S/C34H40ClN3O4/c1-6-22(2)42-32-21-30-27(19-31(32)41-5)20-33(40)38(34(30)26-7-11-28(35)12-8-26)29-13-9-25(10-14-29)23(3)36-15-17-37(18-16-36)24(4)39/h7-14,19,21-23,34H,6,15-18,20H2,1-5H3/t22-,23?,34?/m1/s1
NCI pathway
US Patent
n/an/a 1.12E+4n/an/an/an/an/an/a
Novartis AG
US Patent
Assay Description
The inhibition of p53-Hdm2 and p53-Hdm4 interactions is measured by time resolved fluorescence energy transfer (TR-FRET). Fluorescence energy transfe...
US Patent US9051279 (2015)
BindingDB Entry DOI: 10.7270/Q2DV1HMM
E3 ubiquitin-protein ligase Mdm2
(Homo sapiens (Human))
BDBM161966
(US9051279, 70)
Show SMILES CC[C@@H](C)Oc1cc2C(N(C(=O)Cc2cc1OC)c1ccc(cc1)C(C)N1CCN(CC1)C(C)=O)c1ccc(Cl)cc1 |r|
Show InChI InChI=1S/C34H40ClN3O4/c1-6-22(2)42-32-21-30-27(19-31(32)41-5)20-33(40)38(34(30)26-7-11-28(35)12-8-26)29-13-9-25(10-14-29)23(3)36-15-17-37(18-16-36)24(4)39/h7-14,19,21-23,34H,6,15-18,20H2,1-5H3/t22-,23?,34?/m1/s1
NCI pathway
Reactome pathway
US Patent
n/an/a 15.2n/an/an/an/an/an/a
Novartis AG
US Patent
Assay Description
The inhibition of p53-Hdm2 and p53-Hdm4 interactions is measured by time resolved fluorescence energy transfer (TR-FRET). Fluorescence energy transfe...
US Patent US9051279 (2015)
BindingDB Entry DOI: 10.7270/Q2DV1HMM