BDBM162001 US9682991, 54
SMILES: CN1CCOc2c1c(NCC13CCN(CC1)C3)nn1c(nnc21)-c1cccc(OC(F)(F)F)c1
InChI Key: InChIKey=JHNGOFRBGZJSSP-UHFFFAOYSA-N
Data: 2 IC50
Activity Spreadsheet -- Enzyme Inhibition Constant Data from BindingDB
Found 2 hits for monomerid = 162001
Trg + Lig
Ki
nM
ΔG°
kcal/mole
IC50
nM
Kd
nM
EC50/IC50
nM
koff
s-1
kon
M-1s-1
pHTemp
°C
Serine/threonine-protein kinase pim-2
(Homo sapiens (Human))
BDBM162001
(US9682991, 54)
Show SMILES CN1CCOc2c1c(NCC13CCN(CC1)C3)nn1c(nnc21)-c1cccc(OC(F)(F)F)c1
Show InChI InChI=1S/C22H24F3N7O2/c1-30-9-10-33-17-16(30)18(26-12-21-5-7-31(13-21)8-6-21)29-32-19(27-28-20(17)32)14-3-2-4-15(11-14)34-22(23,24)25/h2-4,11H,5-10,12-13H2,1H3,(H,26,29)
US Patent
n/an/a>1.00E+3n/an/an/an/an/an/a
FUNDACIÓN CENTRO NACIONAL DE INVESTIGACIONES ONCOLOGICAS CARLOS III
US Patent
Assay Description
The biochemical assay to measure PIM-2 activity relies on the ADP Hunter assay kit (DiscoveRx Corp., Cat. #90-0077), that determines the amount of AD...
US Patent US9682991 (2017)
BindingDB Entry DOI: 10.7270/Q2513WCB
Serine/threonine-protein kinase pim-1
(Homo sapiens (Human))
BDBM162001
(US9682991, 54)
Show SMILES CN1CCOc2c1c(NCC13CCN(CC1)C3)nn1c(nnc21)-c1cccc(OC(F)(F)F)c1
Show InChI InChI=1S/C22H24F3N7O2/c1-30-9-10-33-17-16(30)18(26-12-21-5-7-31(13-21)8-6-21)29-32-19(27-28-20(17)32)14-3-2-4-15(11-14)34-22(23,24)25/h2-4,11H,5-10,12-13H2,1H3,(H,26,29)
US Patent
n/an/a<100n/an/an/an/an/an/a
FUNDACIÓN CENTRO NACIONAL DE INVESTIGACIONES ONCOLOGICAS CARLOS III
US Patent
Assay Description
The biochemical assay to measure PIM-1 activity relies on the ADP Hunter assay kit (DiscoveRx Corp., Cat. #90-0077), that determines the amount of AD...
US Patent US9682991 (2017)
BindingDB Entry DOI: 10.7270/Q2513WCB