BDBM16230 (4-chlorophenyl)[4-(9H-purin-6-yl)phenyl]methanamine::1-(4-chlorophenyl)-1-[4-(9H-purin-6-yl)phenyl]methanamine::6-phenylpurine compound 16
SMILES: NC(c1ccc(Cl)cc1)c1ccc(cc1)-c1ncnc2nc[nH]c12
InChI Key: InChIKey=OKPZLGADXZOPNX-UHFFFAOYSA-N
Data: 1 IC50
Activity Spreadsheet -- Enzyme Inhibition Constant Data from BindingDB
Found 1 hit for monomerid = 16230
Trg + Lig
Ki
nM
ΔG°
kcal/mole
IC50
nM
Kd
nM
EC50/IC50
nM
koff
s-1
kon
M-1s-1
pHTemp
°C
Serine/threonine-protein kinase AKT2
(Homo sapiens (Human))
BDBM16230
((4-chlorophenyl)[4-(9H-purin-6-yl)phenyl]methanami...)
Show SMILES NC(c1ccc(Cl)cc1)c1ccc(cc1)-c1ncnc2nc[nH]c12
Show InChI InChI=1S/C18H14ClN5/c19-14-7-5-12(6-8-14)15(20)11-1-3-13(4-2-11)16-17-18(23-9-21-16)24-10-22-17/h1-10,15H,20H2,(H,21,22,23,24)
n/an/a 9n/an/an/an/a7.222
Astex
Assay Description
The purified PKB beta enzyme was assayed with a peptide substrate and test compound in the presence of 30 uM ATP/ [gamma-33P]ATP in 96-well plates. I...
J Med Chem 50: 2289-92 (2007)
Article DOI: 10.1021/jm0700924
BindingDB Entry DOI: 10.7270/Q2M32T1C