BDBM16256 1-N-[(1R,3S,4S)-3-hydroxy-1,6-dimethyl-1-{[(1S)-2-methyl-1-(propan-2-ylcarbamoyl)propyl]carbamoyl}heptan-4-yl]-5-(N-methylmethanesulfonamido)-3-N-propylbenzene-1,3-dicarboxamide::Isophthalamide Derivative 5a
SMILES: CCCNC(=O)c1cc(cc(c1)C(=O)N[C@@H](CC(C)C)[C@@H](O)C[C@@H](C)C(=O)N[C@@H](C(C)C)C(=O)NC(C)C)N(C)S(C)(=O)=O
InChI Key: InChIKey=ASDUQZMMSYNGOP-FBZFJNBBSA-N
Data: 3 KI
Activity Spreadsheet -- Enzyme Inhibition Constant Data from BindingDB
Found 3 hits for monomerid = 16256
Trg + Lig
Ki
nM
ΔG°
kcal/mole
IC50
nM
Kd
nM
EC50/IC50
nM
koff
s-1
kon
M-1s-1
pHTemp
°C
Beta-secretase 1
(Homo sapiens (Human))
BDBM16256
(1-N-[(1R,3S,4S)-3-hydroxy-1,6-dimethyl-1-{[(1S)-2-...)
Show SMILES CCCNC(=O)c1cc(cc(c1)C(=O)N[C@@H](CC(C)C)[C@@H](O)C[C@@H](C)C(=O)N[C@@H](C(C)C)C(=O)NC(C)C)N(C)S(C)(=O)=O |r|
Show InChI InChI=1S/C31H53N5O7S/c1-11-12-32-29(39)22-15-23(17-24(16-22)36(9)44(10,42)43)30(40)34-25(13-18(2)3)26(37)14-21(8)28(38)35-27(19(4)5)31(41)33-20(6)7/h15-21,25-27,37H,11-14H2,1-10H3,(H,32,39)(H,33,41)(H,34,40)(H,35,38)/t21-,25+,26+,27+/m1/s1
52.5 -10.3n/an/an/an/an/a4.537
Purdue University
Assay Description
Enzyme activities were assayed by monitoring the hydrolysis of substrate in the presence or absence of inhibitor compounds. The hydrolysis was record...
J Med Chem 50: 2399-407 (2007)
Article DOI: 10.1021/jm061338s
BindingDB Entry DOI: 10.7270/Q2348HNP
Beta-secretase 2
(Homo sapiens (Human))
BDBM16256
(1-N-[(1R,3S,4S)-3-hydroxy-1,6-dimethyl-1-{[(1S)-2-...)
Show SMILES CCCNC(=O)c1cc(cc(c1)C(=O)N[C@@H](CC(C)C)[C@@H](O)C[C@@H](C)C(=O)N[C@@H](C(C)C)C(=O)NC(C)C)N(C)S(C)(=O)=O |r|
Show InChI InChI=1S/C31H53N5O7S/c1-11-12-32-29(39)22-15-23(17-24(16-22)36(9)44(10,42)43)30(40)34-25(13-18(2)3)26(37)14-21(8)28(38)35-27(19(4)5)31(41)33-20(6)7/h15-21,25-27,37H,11-14H2,1-10H3,(H,32,39)(H,33,41)(H,34,40)(H,35,38)/t21-,25+,26+,27+/m1/s1
340 -9.17n/an/an/an/an/a4.537
Purdue University
Assay Description
Enzyme activities were assayed by monitoring the hydrolysis of substrate in the presence or absence of inhibitor compounds. The hydrolysis was record...
J Med Chem 50: 2399-407 (2007)
Article DOI: 10.1021/jm061338s
BindingDB Entry DOI: 10.7270/Q2348HNP
Cathepsin D
(Homo sapiens (Human))
BDBM16256
(1-N-[(1R,3S,4S)-3-hydroxy-1,6-dimethyl-1-{[(1S)-2-...)
Show SMILES CCCNC(=O)c1cc(cc(c1)C(=O)N[C@@H](CC(C)C)[C@@H](O)C[C@@H](C)C(=O)N[C@@H](C(C)C)C(=O)NC(C)C)N(C)S(C)(=O)=O |r|
Show InChI InChI=1S/C31H53N5O7S/c1-11-12-32-29(39)22-15-23(17-24(16-22)36(9)44(10,42)43)30(40)34-25(13-18(2)3)26(37)14-21(8)28(38)35-27(19(4)5)31(41)33-20(6)7/h15-21,25-27,37H,11-14H2,1-10H3,(H,32,39)(H,33,41)(H,34,40)(H,35,38)/t21-,25+,26+,27+/m1/s1
NCI pathway
Reactome pathway
483 -8.96n/an/an/an/an/a4.537
Purdue University
Assay Description
Enzyme activities were assayed by monitoring the hydrolysis of substrate in the presence or absence of inhibitor compounds. The hydrolysis was record...
J Med Chem 50: 2399-407 (2007)
Article DOI: 10.1021/jm061338s
BindingDB Entry DOI: 10.7270/Q2348HNP