BDBM16261 1-N-[(1R,3S,4S)-3-hydroxy-1,6-dimethyl-1-{[(1S)-2-methyl-1-(propan-2-ylcarbamoyl)propyl]carbamoyl}heptan-4-yl]-3-N-[(1S)-2-hydroxy-1-phenylethyl]-5-(N-methylmethanesulfonamido)benzene-1,3-dicarboxamide::Isophthalamide Derivative 5f
SMILES: CC(C)C[C@H](NC(=O)c1cc(cc(c1)C(=O)N[C@H](CO)c1ccccc1)N(C)S(C)(=O)=O)[C@@H](O)C[C@@H](C)C(=O)N[C@@H](C(C)C)C(=O)NC(C)C
InChI Key: InChIKey=GUIKWSZIYUANFW-KKESWQSKSA-N
Data: 3 KI
Activity Spreadsheet -- Enzyme Inhibition Constant Data from BindingDB
Found 3 hits for monomerid = 16261
Trg + Lig
Ki
nM
ΔG°
kcal/mole
IC50
nM
Kd
nM
EC50/IC50
nM
koff
s-1
kon
M-1s-1
pHTemp
°C
Beta-secretase 2
(Homo sapiens (Human))
BDBM16261
(1-N-[(1R,3S,4S)-3-hydroxy-1,6-dimethyl-1-{[(1S)-2-...)
Show SMILES CC(C)C[C@H](NC(=O)c1cc(cc(c1)C(=O)N[C@H](CO)c1ccccc1)N(C)S(C)(=O)=O)[C@@H](O)C[C@@H](C)C(=O)N[C@@H](C(C)C)C(=O)NC(C)C |r|
Show InChI InChI=1S/C36H55N5O8S/c1-21(2)15-29(31(43)16-24(7)33(44)40-32(22(3)4)36(47)37-23(5)6)38-34(45)26-17-27(19-28(18-26)41(8)50(9,48)49)35(46)39-30(20-42)25-13-11-10-12-14-25/h10-14,17-19,21-24,29-32,42-43H,15-16,20H2,1-9H3,(H,37,47)(H,38,45)(H,39,46)(H,40,44)/t24-,29+,30-,31+,32+/m1/s1
397 -9.08n/an/an/an/an/a4.537
Purdue University
Assay Description
Enzyme activities were assayed by monitoring the hydrolysis of substrate in the presence or absence of inhibitor compounds. The hydrolysis was record...
J Med Chem 50: 2399-407 (2007)
Article DOI: 10.1021/jm061338s
BindingDB Entry DOI: 10.7270/Q2348HNP
Beta-secretase 1
(Homo sapiens (Human))
BDBM16261
(1-N-[(1R,3S,4S)-3-hydroxy-1,6-dimethyl-1-{[(1S)-2-...)
Show SMILES CC(C)C[C@H](NC(=O)c1cc(cc(c1)C(=O)N[C@H](CO)c1ccccc1)N(C)S(C)(=O)=O)[C@@H](O)C[C@@H](C)C(=O)N[C@@H](C(C)C)C(=O)NC(C)C |r|
Show InChI InChI=1S/C36H55N5O8S/c1-21(2)15-29(31(43)16-24(7)33(44)40-32(22(3)4)36(47)37-23(5)6)38-34(45)26-17-27(19-28(18-26)41(8)50(9,48)49)35(46)39-30(20-42)25-13-11-10-12-14-25/h10-14,17-19,21-24,29-32,42-43H,15-16,20H2,1-9H3,(H,37,47)(H,38,45)(H,39,46)(H,40,44)/t24-,29+,30-,31+,32+/m1/s1
438 -9.02n/an/an/an/an/a4.537
Purdue University
Assay Description
Enzyme activities were assayed by monitoring the hydrolysis of substrate in the presence or absence of inhibitor compounds. The hydrolysis was record...
J Med Chem 50: 2399-407 (2007)
Article DOI: 10.1021/jm061338s
BindingDB Entry DOI: 10.7270/Q2348HNP
Cathepsin D
(Homo sapiens (Human))
BDBM16261
(1-N-[(1R,3S,4S)-3-hydroxy-1,6-dimethyl-1-{[(1S)-2-...)
Show SMILES CC(C)C[C@H](NC(=O)c1cc(cc(c1)C(=O)N[C@H](CO)c1ccccc1)N(C)S(C)(=O)=O)[C@@H](O)C[C@@H](C)C(=O)N[C@@H](C(C)C)C(=O)NC(C)C |r|
Show InChI InChI=1S/C36H55N5O8S/c1-21(2)15-29(31(43)16-24(7)33(44)40-32(22(3)4)36(47)37-23(5)6)38-34(45)26-17-27(19-28(18-26)41(8)50(9,48)49)35(46)39-30(20-42)25-13-11-10-12-14-25/h10-14,17-19,21-24,29-32,42-43H,15-16,20H2,1-9H3,(H,37,47)(H,38,45)(H,39,46)(H,40,44)/t24-,29+,30-,31+,32+/m1/s1
NCI pathway
Reactome pathway
633 -8.79n/an/an/an/an/a4.537
Purdue University
Assay Description
Enzyme activities were assayed by monitoring the hydrolysis of substrate in the presence or absence of inhibitor compounds. The hydrolysis was record...
J Med Chem 50: 2399-407 (2007)
Article DOI: 10.1021/jm061338s
BindingDB Entry DOI: 10.7270/Q2348HNP