BDBM162850 US9056843, 141
SMILES: CCCN(CCC)C[C@@H](C)NC(=O)c1ccc(cc1F)-c1noc(n1)C(F)(F)F
InChI Key: InChIKey=GSSWPNVQSNAXRF-GFCCVEGCSA-N
Data: 3 IC50
Activity Spreadsheet -- Enzyme Inhibition Constant Data from BindingDB
Found 3 hits for monomerid = 162850
Trg + Lig
Ki
nM
ΔG°
kcal/mole
IC50
nM
Kd
nM
EC50/IC50
nM
koff
s-1
kon
M-1s-1
pHTemp
°C
Histone deacetylase 1
(Homo sapiens (Human))
BDBM162850
(US9056843, 141)
Show SMILES CCCN(CCC)C[C@@H](C)NC(=O)c1ccc(cc1F)-c1noc(n1)C(F)(F)F |r|
Show InChI InChI=1S/C19H24F4N4O2/c1-4-8-27(9-5-2)11-12(3)24-17(28)14-7-6-13(10-15(14)20)16-25-18(29-26-16)19(21,22)23/h6-7,10,12H,4-5,8-9,11H2,1-3H3,(H,24,28)/t12-/m1/s1
NCI pathway
Reactome pathway
US Patent
n/an/a 4.20E+3n/an/an/an/a8.025
NOVARTIS AG
US Patent
Assay Description
A similar assay procedure as described in Test 2 was used for HDAC1. Human recombinant full length HDAC1 expressed in a baculovirus expression system...
US Patent US9056843 (2015)
BindingDB Entry DOI: 10.7270/Q24F1PG8
Cereblon/Histone deacetylase 6
(Homo sapiens (Human))
BDBM162850
(US9056843, 141)
Show SMILES CCCN(CCC)C[C@@H](C)NC(=O)c1ccc(cc1F)-c1noc(n1)C(F)(F)F |r|
Show InChI InChI=1S/C19H24F4N4O2/c1-4-8-27(9-5-2)11-12(3)24-17(28)14-7-6-13(10-15(14)20)16-25-18(29-26-16)19(21,22)23/h6-7,10,12H,4-5,8-9,11H2,1-3H3,(H,24,28)/t12-/m1/s1
NCI pathway
Reactome pathway
US Patent
n/an/a 1.40E+3n/an/an/an/a8.025
NOVARTIS AG
US Patent
Assay Description
A similar assay procedure as described in Test 2 was used for HDAC6. Human recombinant full length HDAC6 expressed in a baculovirus expression system...
US Patent US9056843 (2015)
BindingDB Entry DOI: 10.7270/Q24F1PG8
Histone deacetylase 4
(Homo sapiens (Human))
BDBM162850
(US9056843, 141)
Show SMILES CCCN(CCC)C[C@@H](C)NC(=O)c1ccc(cc1F)-c1noc(n1)C(F)(F)F |r|
Show InChI InChI=1S/C19H24F4N4O2/c1-4-8-27(9-5-2)11-12(3)24-17(28)14-7-6-13(10-15(14)20)16-25-18(29-26-16)19(21,22)23/h6-7,10,12H,4-5,8-9,11H2,1-3H3,(H,24,28)/t12-/m1/s1
US Patent
n/an/a 1.40n/an/an/an/a8.025
NOVARTIS AG
US Patent
Assay Description
Human recombinant HDAC4 was expressed in full length form (aa 2-1084) in Sf9 insect cells (obtained from ATCC) using baculovirus generated with Bac-t...
US Patent US9056843 (2015)
BindingDB Entry DOI: 10.7270/Q24F1PG8