BDBM162852 US9056843, 143
SMILES: CCCN(C)C[C@@H](C)NC(=O)c1ccc(cc1F)-c1noc(n1)C(F)(F)F
InChI Key: InChIKey=OBJZEJYAHAWEPJ-SNVBAGLBSA-N
Data: 3 IC50
Activity Spreadsheet -- Enzyme Inhibition Constant Data from BindingDB
Found 3 hits for monomerid = 162852
Trg + Lig
Ki
nM
ΔG°
kcal/mole
IC50
nM
Kd
nM
EC50/IC50
nM
koff
s-1
kon
M-1s-1
pHTemp
°C
Histone deacetylase 1
(Homo sapiens (Human))
BDBM162852
(US9056843, 143)
Show SMILES CCCN(C)C[C@@H](C)NC(=O)c1ccc(cc1F)-c1noc(n1)C(F)(F)F |r|
Show InChI InChI=1S/C17H20F4N4O2/c1-4-7-25(3)9-10(2)22-15(26)12-6-5-11(8-13(12)18)14-23-16(27-24-14)17(19,20)21/h5-6,8,10H,4,7,9H2,1-3H3,(H,22,26)/t10-/m1/s1
NCI pathway
Reactome pathway
US Patent
n/an/a 5.80E+3n/an/an/an/a8.025
NOVARTIS AG
US Patent
Assay Description
A similar assay procedure as described in Test 2 was used for HDAC1. Human recombinant full length HDAC1 expressed in a baculovirus expression system...
US Patent US9056843 (2015)
BindingDB Entry DOI: 10.7270/Q24F1PG8
Cereblon/Histone deacetylase 6
(Homo sapiens (Human))
BDBM162852
(US9056843, 143)
Show SMILES CCCN(C)C[C@@H](C)NC(=O)c1ccc(cc1F)-c1noc(n1)C(F)(F)F |r|
Show InChI InChI=1S/C17H20F4N4O2/c1-4-7-25(3)9-10(2)22-15(26)12-6-5-11(8-13(12)18)14-23-16(27-24-14)17(19,20)21/h5-6,8,10H,4,7,9H2,1-3H3,(H,22,26)/t10-/m1/s1
NCI pathway
Reactome pathway
US Patent
n/an/a 3.30E+3n/an/an/an/a8.025
NOVARTIS AG
US Patent
Assay Description
A similar assay procedure as described in Test 2 was used for HDAC6. Human recombinant full length HDAC6 expressed in a baculovirus expression system...
US Patent US9056843 (2015)
BindingDB Entry DOI: 10.7270/Q24F1PG8
Histone deacetylase 4
(Homo sapiens (Human))
BDBM162852
(US9056843, 143)
Show SMILES CCCN(C)C[C@@H](C)NC(=O)c1ccc(cc1F)-c1noc(n1)C(F)(F)F |r|
Show InChI InChI=1S/C17H20F4N4O2/c1-4-7-25(3)9-10(2)22-15(26)12-6-5-11(8-13(12)18)14-23-16(27-24-14)17(19,20)21/h5-6,8,10H,4,7,9H2,1-3H3,(H,22,26)/t10-/m1/s1
US Patent
n/an/a 1.20n/an/an/an/a8.025
NOVARTIS AG
US Patent
Assay Description
Human recombinant HDAC4 was expressed in full length form (aa 2-1084) in Sf9 insect cells (obtained from ATCC) using baculovirus generated with Bac-t...
US Patent US9056843 (2015)
BindingDB Entry DOI: 10.7270/Q24F1PG8