BDBM162887 US9056865, A-14
SMILES: Cc1cnc(c(C)c1)-c1cc(ncc1Cl)N1CCC(CC1)NS(C)(=O)=O
InChI Key: InChIKey=KJEQLJODGLWFGB-UHFFFAOYSA-N
Data: 1 IC50
Activity Spreadsheet -- Enzyme Inhibition Constant Data from BindingDB
Found 1 hit for monomerid = 162887
Trg + Lig
Ki
nM
ΔG°
kcal/mole
IC50
nM
Kd
nM
EC50/IC50
nM
koff
s-1
kon
M-1s-1
pHTemp
°C
G-protein- coupled-like receptor Smoothened (Smo)
(Homo sapiens (Human))
BDBM162887
(US9056865, A-14)
Show SMILES Cc1cnc(c(C)c1)-c1cc(ncc1Cl)N1CCC(CC1)NS(C)(=O)=O
Show InChI InChI=1S/C18H23ClN4O2S/c1-12-8-13(2)18(21-10-12)15-9-17(20-11-16(15)19)23-6-4-14(5-7-23)22-26(3,24)25/h8-11,14,22H,4-7H2,1-3H3
US Patent
n/an/a 6.40n/an/an/an/an/a25
Pfizer Inc.
US Patent
Assay Description
For the binding competition assay, 100 μL of Assay Buffer was added to all the wells of a 96 well GF/B filter plate (Millipore MultiScreen-HTS-F...
US Patent US9056865 (2015)
BindingDB Entry DOI: 10.7270/Q2R49PH7