BDBM162966 US9056865, A-93
SMILES: Cc1cccnc1-c1cc(ncc1Cl)N1CCN(CC1)C(=O)CCS(C)(=O)=O
InChI Key: InChIKey=DMCAUTQRADFYJE-UHFFFAOYSA-N
Data: 1 IC50
Activity Spreadsheet -- Enzyme Inhibition Constant Data from BindingDB
Found 1 hit for monomerid = 162966
Trg + Lig
Ki
nM
ΔG°
kcal/mole
IC50
nM
Kd
nM
EC50/IC50
nM
koff
s-1
kon
M-1s-1
pHTemp
°C
G-protein- coupled-like receptor Smoothened (Smo)
(Homo sapiens (Human))
BDBM162966
(US9056865, A-93)
Show SMILES Cc1cccnc1-c1cc(ncc1Cl)N1CCN(CC1)C(=O)CCS(C)(=O)=O
Show InChI InChI=1S/C19H23ClN4O3S/c1-14-4-3-6-21-19(14)15-12-17(22-13-16(15)20)23-7-9-24(10-8-23)18(25)5-11-28(2,26)27/h3-4,6,12-13H,5,7-11H2,1-2H3
US Patent
n/an/a 9.84n/an/an/an/an/a25
Pfizer Inc.
US Patent
Assay Description
For the binding competition assay, 100 μL of Assay Buffer was added to all the wells of a 96 well GF/B filter plate (Millipore MultiScreen-HTS-F...
US Patent US9056865 (2015)
BindingDB Entry DOI: 10.7270/Q2R49PH7