BDBM163032 US9061041, 26
SMILES: CC(C)OC(=O)[C@H](C)NP(=O)(OC[C@H]1O[C@@H](n2ccc(N)nc2=O)[C@](C)(N)C1O)Oc1ccccc1
InChI Key: InChIKey=XBNWFIVVQWDZDK-YMFFAKLASA-N
Data: 1 KI
Activity Spreadsheet -- Enzyme Inhibition Constant Data from BindingDB
Found 1 hit for monomerid = 163032
Trg + Lig
Ki
nM
ΔG°
kcal/mole
IC50
nM
Kd
nM
EC50/IC50
nM
koff
s-1
kon
M-1s-1
pHTemp
°C
Genome polyprotein
(Hepatitis C virus (HCV genotype 1a, isolate H))
BDBM163032
(US9061041, 26)
Show SMILES CC(C)OC(=O)[C@H](C)NP(=O)(OC[C@H]1O[C@@H](n2ccc(N)nc2=O)[C@](C)(N)C1O)Oc1ccccc1 |r|
Show InChI InChI=1S/C22H32N5O8P/c1-13(2)33-19(29)14(3)26-36(31,35-15-8-6-5-7-9-15)32-12-16-18(28)22(4,24)20(34-16)27-11-10-17(23)25-21(27)30/h5-11,13-14,16,18,20,28H,12,24H2,1-4H3,(H,26,31)(H2,23,25,30)/t14-,16+,18?,20+,22+,36?/m0/s1
US Patent
70 -9.75n/an/an/an/an/a7.325
Merck Sharp & Dohme Corp.
US Patent
Assay Description
To measure inhibition of the enzymatic activity of the HCV NS5B RNA-dependent RNA polymerase by the nucleoside triphosphate compounds of the present ...
US Patent US9061041 (2015)
BindingDB Entry DOI: 10.7270/Q2GM862K