BDBM16321 3-{[5-cyano-6-(methylamino)pyrimidin-4-yl]amino}-N-methoxy-4-methylbenzamide::5-Cyanopyrimidine Derivative 14a
SMILES: CNc1ncnc(Nc2cc(ccc2C)C(=O)NOC)c1C#N
InChI Key: InChIKey=BQXDLQUNDYMBSC-UHFFFAOYSA-N
Data: 1 KI
Activity Spreadsheet -- Enzyme Inhibition Constant Data from BindingDB
Found 1 hit for monomerid = 16321
Trg + Lig
Ki
nM
ΔG°
kcal/mole
IC50
nM
Kd
nM
EC50/IC50
nM
koff
s-1
kon
M-1s-1
pHTemp
°C
Mitogen-activated protein kinase 14
(Homo sapiens (Human))
BDBM16321
(3-{[5-cyano-6-(methylamino)pyrimidin-4-yl]amino}-N...)
Show SMILES CNc1ncnc(Nc2cc(ccc2C)C(=O)NOC)c1C#N
Show InChI InChI=1S/C15H16N6O2/c1-9-4-5-10(15(22)21-23-3)6-12(9)20-14-11(7-16)13(17-2)18-8-19-14/h4-6,8H,1-3H3,(H,21,22)(H2,17,18,19,20)
NCI pathway
Reactome pathway
16 -10.5n/an/an/an/an/a7.422
Bristol-Myers Squibb Company
Assay Description
The kinase activity was determined by quantitation of the amount of radioactive phosphate transferred to myelin basic protein (MBP) with or without i...
J Med Chem 48: 6261-70 (2005)
Article DOI: 10.1021/jm0503594
BindingDB Entry DOI: 10.7270/Q25X276T