BDBM16326 3-{[5-cyano-6-(cyclopentylamino)pyrimidin-4-yl]amino}-4-methyl-N-(1,2-oxazol-3-yl)benzamide::3-{[5-cyano-6-(cyclopentylamino)pyrimidin-4-yl]amino}-N-isoxazol-3-yl-4-methylbenzamide::5-Cyanopyrimidine Derivative 3b
SMILES: Cc1ccc(cc1Nc1ncnc(NC2CCCC2)c1C#N)C(=O)Nc1ccon1
InChI Key: InChIKey=JLIDQWKTZPUAMJ-UHFFFAOYSA-N
Data: 1 KI
Activity Spreadsheet -- Enzyme Inhibition Constant Data from BindingDB
Found 1 hit for monomerid = 16326
Trg + Lig
Ki
nM
ΔG°
kcal/mole
IC50
nM
Kd
nM
EC50/IC50
nM
koff
s-1
kon
M-1s-1
pHTemp
°C
Mitogen-activated protein kinase 14
(Homo sapiens (Human))
BDBM16326
(3-{[5-cyano-6-(cyclopentylamino)pyrimidin-4-yl]ami...)
Show SMILES Cc1ccc(cc1Nc1ncnc(NC2CCCC2)c1C#N)C(=O)Nc1ccon1
Show InChI InChI=1S/C21H21N7O2/c1-13-6-7-14(21(29)27-18-8-9-30-28-18)10-17(13)26-20-16(11-22)19(23-12-24-20)25-15-4-2-3-5-15/h6-10,12,15H,2-5H2,1H3,(H,27,28,29)(H2,23,24,25,26)
NCI pathway
Reactome pathway
1.60 -11.9n/an/an/an/an/a7.422
Bristol-Myers Squibb Company
Assay Description
The kinase activity was determined by quantitation of the amount of radioactive phosphate transferred to myelin basic protein (MBP) with or without i...
J Med Chem 48: 6261-70 (2005)
Article DOI: 10.1021/jm0503594
BindingDB Entry DOI: 10.7270/Q25X276T