null
SMILES: CCn1nccc1NC(=O)c1ccc(C)c(Nc2ncnc(NC3CCCC3)c2C#N)c1
InChI Key: InChIKey=OPBZEBLTFIONGE-UHFFFAOYSA-N
Activity Spreadsheet -- Enzyme Inhibition Constant Data from BindingDB
Found 1 hit for monomerid = 16328
Trg + Lig
Ki
nM
ΔG°
kcal/mole
IC50
nM
Kd
nM
EC50/IC50
nM
koff
s-1
kon
M-1s-1
pHTemp
°C
Mitogen-activated protein kinase 14
(Homo sapiens (Human))
BDBM16328
(3-{[5-cyano-6-(cyclopentylamino)pyrimidin-4-yl]ami...)
Show SMILES CCn1nccc1NC(=O)c1ccc(C)c(Nc2ncnc(NC3CCCC3)c2C#N)c1
Show InChI InChI=1S/C23H26N8O/c1-3-31-20(10-11-27-31)30-23(32)16-9-8-15(2)19(12-16)29-22-18(13-24)21(25-14-26-22)28-17-6-4-5-7-17/h8-12,14,17H,3-7H2,1-2H3,(H,30,32)(H2,25,26,28,29)
NCI pathway
Reactome pathway
14 -10.6n/an/an/an/an/a7.422
Bristol-Myers Squibb Company
Assay Description
The kinase activity was determined by quantitation of the amount of radioactive phosphate transferred to myelin basic protein (MBP) with or without i...
J Med Chem 48: 6261-70 (2005)
Article DOI: 10.1021/jm0503594
BindingDB Entry DOI: 10.7270/Q25X276T