BDBM1635 10-methyl-2-propyl-2,4,10-triazatricyclo[9.4.0.0^{3,8}]pentadeca-1(11),3(8),4,6,12,14-hexaen-9-one::Pyridobenzodiazepinone deriv. 15
SMILES: CCCN1c2ccccc2N(C)C(=O)c2cccnc12
InChI Key: InChIKey=OXERMLHLBWPCON-UHFFFAOYSA-N
Data: 1 IC50
Activity Spreadsheet -- Enzyme Inhibition Constant Data from BindingDB
Found 1 hit for monomerid = 1635
Trg + Lig
Ki
nM
ΔG°
kcal/mole
IC50
nM
Kd
nM
EC50/IC50
nM
koff
s-1
kon
M-1s-1
pHTemp
°C
HIV-1 Reverse Transcriptase
(Human immunodeficiency virus type 1)
BDBM1635
(10-methyl-2-propyl-2,4,10-triazatricyclo[9.4.0.0^{...)
Show SMILES CCCN1c2ccccc2N(C)C(=O)c2cccnc12
Show InChI InChI=1S/C16H17N3O/c1-3-11-19-14-9-5-4-8-13(14)18(2)16(20)12-7-6-10-17-15(12)19/h4-10H,3,11H2,1-2H3
n/an/a 230n/an/an/an/a7.822
Boehringer Ingelheim Pharmaceuticals Inc.
Assay Description
The IC50 of reverse transcriptase is the concentration that inhibits 50% of recombinant HIV-1 RT RNA-directed DNA polymerase activity in vitro.
J Med Chem 34: 2231-41 (1991)
Article DOI: 10.1021/jm00111a045
BindingDB Entry DOI: 10.7270/Q2TT4P4X