BDBM163653 MbA-CG (7)
SMILES: C[C@@H]1O[C@@H](O[C@@H]2CO[C@@H](Oc3c(O)cc(cc3O)-c3oc4cc(O)cc(O)c4c(=O)c3O[C@@H]3O[C@@H](C)[C@H](O)[C@@H](O)[C@H]3O[C@@H]3O[C@H](CO)[C@@H](O)[C@H](O)[C@H]3O)[C@H](O)[C@H]2O)[C@H](O)[C@H](O)[C@H]1O
InChI Key: InChIKey=BGEFVPIGIMHZKN-DBZPCQSQSA-N
Data: 1 KI
Activity Spreadsheet -- Enzyme Inhibition Constant Data from BindingDB
Found 1 hit for monomerid = 163653
Trg + Lig
Ki
nM
ΔG°
kcal/mole
IC50
nM
Kd
nM
EC50/IC50
nM
koff
s-1
kon
M-1s-1
pHTemp
°C
Pancreatic alpha-amylase (HPA)
(Homo sapiens (Human))
BDBM163653
(MbA-CG (7))
Show SMILES C[C@@H]1O[C@@H](O[C@@H]2CO[C@@H](Oc3c(O)cc(cc3O)-c3oc4cc(O)cc(O)c4c(=O)c3O[C@@H]3O[C@@H](C)[C@H](O)[C@@H](O)[C@H]3O[C@@H]3O[C@H](CO)[C@@H](O)[C@H](O)[C@H]3O)[C@H](O)[C@H]2O)[C@H](O)[C@H](O)[C@H]1O
Show InChI InChI=1S/C38H48O25/c1-9-20(44)25(49)29(53)36(56-9)60-18-8-55-35(28(52)23(18)47)61-32-14(42)3-11(4-15(32)43)31-33(24(48)19-13(41)5-12(40)6-16(19)58-31)62-38-34(27(51)21(45)10(2)57-38)63-37-30(54)26(50)22(46)17(7-39)59-37/h3-6,9-10,17-18,20-23,25-30,34-47,49-54H,7-8H2,1-2H3/t9-,10-,17+,18+,20-,21-,22+,23-,25+,26-,27+,28+,29+,30+,34+,35-,36-,37-,38-/m0/s1
2.24E+3 -7.83n/an/an/an/an/an/a30
University of British Columbia
Assay Description
Inhibitor concentrations varied from 0.25 to 5 times the Ki value in 50 mM sodium phosphate, 100 mM sodium chloride buffer, pH 7.0, at 30 °C. 2-Chlor...
Nat Chem Biol 11: 691-6 (2015)
Article DOI: 10.1038/nchembio.1865
BindingDB Entry DOI: 10.7270/Q2KD1WP4