BDBM16393 5-{3-tert-butyl-[1,2,4]triazolo[3,4-a]pyridin-6-yl}-4-(2,4-difluorophenyl)-1,3-oxazole::triazolopyridine oxazole inhibitor 64
SMILES: CC(C)(C)c1nnc2ccc(cn12)-c1ocnc1-c1ccc(F)cc1F
InChI Key: InChIKey=XTZMVZVCDOJUJH-UHFFFAOYSA-N
Data: 1 IC50
Activity Spreadsheet -- Enzyme Inhibition Constant Data from BindingDB
Found 1 hit for monomerid = 16393
Trg + Lig
Ki
nM
ΔG°
kcal/mole
IC50
nM
Kd
nM
EC50/IC50
nM
koff
s-1
kon
M-1s-1
pHTemp
°C
Mitogen-activated protein kinase 14
(Homo sapiens (Human))
BDBM16393
(5-{3-tert-butyl-[1,2,4]triazolo[3,4-a]pyridin-6-yl...)
Show SMILES CC(C)(C)c1nnc2ccc(cn12)-c1ocnc1-c1ccc(F)cc1F
Show InChI InChI=1S/C19H16F2N4O/c1-19(2,3)18-24-23-15-7-4-11(9-25(15)18)17-16(22-10-26-17)13-6-5-12(20)8-14(13)21/h4-10H,1-3H3
NCI pathway
Reactome pathway
n/an/a 1.10n/an/an/an/an/an/a
Pfizer
Assay Description
The IC50s were determined by incubating each test compound with activated p38-alpha in a 96-well plate that had been pre-treated with ATF-2-GST to al...
Bioorg Med Chem Lett 16: 4339-44 (2006)
Article DOI: 10.1016/j.bmcl.2006.05.056
BindingDB Entry DOI: 10.7270/Q2251GFZ