BDBM16398 4-(2,5-difluorophenyl)-5-[3-(1-methylcyclobutyl)-[1,2,4]triazolo[3,4-a]pyridin-6-yl]-1,3-oxazole::triazolopyridine oxazole inhibitor 69
SMILES: CC1(CCC1)c1nnc2ccc(cn12)-c1ocnc1-c1cc(F)ccc1F
InChI Key: InChIKey=GJTSFEDWYSEVOG-UHFFFAOYSA-N
Data: 1 IC50
Activity Spreadsheet -- Enzyme Inhibition Constant Data from BindingDB
Found 1 hit for monomerid = 16398
Trg + Lig
Ki
nM
ΔG°
kcal/mole
IC50
nM
Kd
nM
EC50/IC50
nM
koff
s-1
kon
M-1s-1
pHTemp
°C
Mitogen-activated protein kinase 14
(Homo sapiens (Human))
BDBM16398
(4-(2,5-difluorophenyl)-5-[3-(1-methylcyclobutyl)-[...)
Show SMILES CC1(CCC1)c1nnc2ccc(cn12)-c1ocnc1-c1cc(F)ccc1F
Show InChI InChI=1S/C20H16F2N4O/c1-20(7-2-8-20)19-25-24-16-6-3-12(10-26(16)19)18-17(23-11-27-18)14-9-13(21)4-5-15(14)22/h3-6,9-11H,2,7-8H2,1H3
NCI pathway
Reactome pathway
n/an/a 1.5n/an/an/an/an/an/a
Pfizer
Assay Description
The IC50s were determined by incubating each test compound with activated p38-alpha in a 96-well plate that had been pre-treated with ATF-2-GST to al...
Bioorg Med Chem Lett 16: 4339-44 (2006)
Article DOI: 10.1016/j.bmcl.2006.05.056
BindingDB Entry DOI: 10.7270/Q2251GFZ