BDBM16404 5-{3-tert-butyl-[1,2,4]triazolo[3,4-a]pyridin-6-yl}-4-(2,4,5-trifluorophenyl)-1,3-oxazole::triazolopyridine oxazole inhibitor 75
SMILES: CC(C)(C)c1nnc2ccc(cn12)-c1ocnc1-c1cc(F)c(F)cc1F
InChI Key: InChIKey=VNZJNPIWZYMGAO-UHFFFAOYSA-N
Data: 1 IC50
Activity Spreadsheet -- Enzyme Inhibition Constant Data from BindingDB
Found 1 hit for monomerid = 16404
Trg + Lig
Ki
nM
ΔG°
kcal/mole
IC50
nM
Kd
nM
EC50/IC50
nM
koff
s-1
kon
M-1s-1
pHTemp
°C
Mitogen-activated protein kinase 14
(Homo sapiens (Human))
BDBM16404
(5-{3-tert-butyl-[1,2,4]triazolo[3,4-a]pyridin-6-yl...)
Show SMILES CC(C)(C)c1nnc2ccc(cn12)-c1ocnc1-c1cc(F)c(F)cc1F
Show InChI InChI=1S/C19H15F3N4O/c1-19(2,3)18-25-24-15-5-4-10(8-26(15)18)17-16(23-9-27-17)11-6-13(21)14(22)7-12(11)20/h4-9H,1-3H3
NCI pathway
Reactome pathway
n/an/a 1.80n/an/an/an/an/an/a
Pfizer
Assay Description
The IC50s were determined by incubating each test compound with activated p38-alpha in a 96-well plate that had been pre-treated with ATF-2-GST to al...
Bioorg Med Chem Lett 16: 4339-44 (2006)
Article DOI: 10.1016/j.bmcl.2006.05.056
BindingDB Entry DOI: 10.7270/Q2251GFZ