BDBM16405 3-(2,5-difluorophenyl)-4-[3-(propan-2-yl)-[1,2,4]triazolo[3,4-a]pyridin-6-yl]-1H-pyrazole::pyrazole 79
SMILES: CC(C)c1nnc2ccc(cn12)-c1c[nH]nc1-c1cc(F)ccc1F
InChI Key: InChIKey=XQFBFBBFUGBKRH-UHFFFAOYSA-N
Data: 1 IC50
Activity Spreadsheet -- Enzyme Inhibition Constant Data from BindingDB
Found 1 hit for monomerid = 16405
Trg + Lig
Ki
nM
ΔG°
kcal/mole
IC50
nM
Kd
nM
EC50/IC50
nM
koff
s-1
kon
M-1s-1
pHTemp
°C
Mitogen-activated protein kinase 14
(Homo sapiens (Human))
BDBM16405
(3-(2,5-difluorophenyl)-4-[3-(propan-2-yl)-[1,2,4]t...)
Show SMILES CC(C)c1nnc2ccc(cn12)-c1c[nH]nc1-c1cc(F)ccc1F
Show InChI InChI=1S/C18H15F2N5/c1-10(2)18-24-22-16-6-3-11(9-25(16)18)14-8-21-23-17(14)13-7-12(19)4-5-15(13)20/h3-10H,1-2H3,(H,21,23)
NCI pathway
Reactome pathway
n/an/a 2.80n/an/an/an/an/an/a
Pfizer
Assay Description
The IC50s were determined by incubating each test compound with activated p38-alpha in a 96-well plate that had been pre-treated with ATF-2-GST to al...
Bioorg Med Chem Lett 16: 4339-44 (2006)
Article DOI: 10.1016/j.bmcl.2006.05.056
BindingDB Entry DOI: 10.7270/Q2251GFZ