BDBM164213 US9688615, 24
SMILES: NCC(=O)NCc1nc2cc(cc(c2[nH]1)C(F)(F)F)C(F)(F)F
InChI Key: InChIKey=TWXCYETVTGQUSO-UHFFFAOYSA-N
Data: 8 IC50
Activity Spreadsheet -- Enzyme Inhibition Constant Data from BindingDB
Found 8 hits for monomerid = 164213
Trg + Lig
Ki
nM
ΔG°
kcal/mole
IC50
nM
Kd
nM
EC50/IC50
nM
koff
s-1
kon
M-1s-1
pHTemp
°C
Voltage-gated calcium channel subunit alpha Cav2.2
(Homo sapiens (Human))
BDBM164213
(US9688615, 24)
Show SMILES NCC(=O)NCc1nc2cc(cc(c2[nH]1)C(F)(F)F)C(F)(F)F
Show InChI InChI=1S/C12H10F6N4O/c13-11(14,15)5-1-6(12(16,17)18)10-7(2-5)21-8(22-10)4-20-9(23)3-19/h1-2H,3-4,19H2,(H,20,23)(H,21,22)
US Patent
n/an/a>1.00E+4n/an/an/an/an/an/a
SRMLSC
US Patent
Assay Description
Cells were plated in 384-well, clear-bottom, black-walled, poly-D-lysine coated plates (Becton Dickinson, Franklin Lake, N.J.) 2 days prior to use in...
US Patent US9688615 (2017)
BindingDB Entry DOI: 10.7270/Q27S7KXH
Voltage-gated calcium channel subunit alpha Cav2.2
(Homo sapiens (Human))
BDBM164213
(US9688615, 24)
Show SMILES NCC(=O)NCc1nc2cc(cc(c2[nH]1)C(F)(F)F)C(F)(F)F
Show InChI InChI=1S/C12H10F6N4O/c13-11(14,15)5-1-6(12(16,17)18)10-7(2-5)21-8(22-10)4-20-9(23)3-19/h1-2H,3-4,19H2,(H,20,23)(H,21,22)
US Patent
n/an/a>1.00E+4n/an/an/an/an/an/a
SRMLSC
US Patent
Assay Description
Cells were plated in 384-well, clear-bottom, black-walled, poly-D-lysine coated plates (Becton Dickinson, Franklin Lake, N.J.) 2 days prior to use in...
US Patent US9688615 (2017)
BindingDB Entry DOI: 10.7270/Q27S7KXH
Voltage-gated T-type calcium channel
(Homo sapiens (Human))
BDBM164213
(US9688615, 24)
Show SMILES NCC(=O)NCc1nc2cc(cc(c2[nH]1)C(F)(F)F)C(F)(F)F
Show InChI InChI=1S/C12H10F6N4O/c13-11(14,15)5-1-6(12(16,17)18)10-7(2-5)21-8(22-10)4-20-9(23)3-19/h1-2H,3-4,19H2,(H,20,23)(H,21,22)
NCI pathway
Reactome pathway
US Patent
n/an/a>1.00E+4n/an/an/an/an/an/a
SRMLSC
US Patent
Assay Description
Cells were plated in 384-well, clear-bottom, black-walled, poly-D-lysine coated plates (Becton Dickinson, Franklin Lake, N.J.) 2 days prior to use in...
US Patent US9688615 (2017)
BindingDB Entry DOI: 10.7270/Q27S7KXH
Sodium channel protein type 5 subunit alpha
(Homo sapiens (Human))
BDBM164213
(US9688615, 24)
Show SMILES NCC(=O)NCc1nc2cc(cc(c2[nH]1)C(F)(F)F)C(F)(F)F
Show InChI InChI=1S/C12H10F6N4O/c13-11(14,15)5-1-6(12(16,17)18)10-7(2-5)21-8(22-10)4-20-9(23)3-19/h1-2H,3-4,19H2,(H,20,23)(H,21,22)
US Patent
n/an/a>1.00E+4n/an/an/an/a7.4n/a
SRMLSC
US Patent
Assay Description
To assess the potential cardiac liability of compounds at an early stage in the drug discovery process, a Nav1.5 sodium channel screening assay was b...
US Patent US9688615 (2017)
BindingDB Entry DOI: 10.7270/Q27S7KXH
Voltage-dependent T-type calcium channel subunit alpha-1H
(Homo sapiens (Human))
BDBM164213
(US9688615, 24)
Show SMILES NCC(=O)NCc1nc2cc(cc(c2[nH]1)C(F)(F)F)C(F)(F)F
Show InChI InChI=1S/C12H10F6N4O/c13-11(14,15)5-1-6(12(16,17)18)10-7(2-5)21-8(22-10)4-20-9(23)3-19/h1-2H,3-4,19H2,(H,20,23)(H,21,22)
US Patent
n/an/a 3.09E+3n/an/an/an/an/an/a
SRMLSC
US Patent
Assay Description
Cells were plated in 384-well, clear-bottom, black-walled, poly-D-lysine coated plates (Becton Dickinson, Franklin Lake, N.J.) 2 days prior to use in...
US Patent US9688615 (2017)
BindingDB Entry DOI: 10.7270/Q27S7KXH
Calcium channel (Type L)
(Homo sapiens (Human))
BDBM164213
(US9688615, 24)
Show SMILES NCC(=O)NCc1nc2cc(cc(c2[nH]1)C(F)(F)F)C(F)(F)F
Show InChI InChI=1S/C12H10F6N4O/c13-11(14,15)5-1-6(12(16,17)18)10-7(2-5)21-8(22-10)4-20-9(23)3-19/h1-2H,3-4,19H2,(H,20,23)(H,21,22)
US Patent
n/an/a>1.00E+4n/an/an/an/a7.4n/a
SRMLSC
US Patent
Assay Description
To assess the potential cardiac liability of compounds at an early stage in the drug discovery process, a Nav1.5 sodium channel screening assay was b...
US Patent US9688615 (2017)
BindingDB Entry DOI: 10.7270/Q27S7KXH
Calcium channel (Type L)
(Homo sapiens (Human))
BDBM164213
(US9688615, 24)
Show SMILES NCC(=O)NCc1nc2cc(cc(c2[nH]1)C(F)(F)F)C(F)(F)F
Show InChI InChI=1S/C12H10F6N4O/c13-11(14,15)5-1-6(12(16,17)18)10-7(2-5)21-8(22-10)4-20-9(23)3-19/h1-2H,3-4,19H2,(H,20,23)(H,21,22)
US Patent
n/an/a>1.00E+4n/an/an/an/a7.4n/a
SRMLSC
US Patent
Assay Description
To assess the potential cardiac liability of compounds at an early stage in the drug discovery process, a Nav1.5 sodium channel screening assay was b...
US Patent US9688615 (2017)
BindingDB Entry DOI: 10.7270/Q27S7KXH
Voltage-dependent T-type calcium channel subunit alpha-1H
(Homo sapiens (Human))
BDBM164213
(US9688615, 24)
Show SMILES NCC(=O)NCc1nc2cc(cc(c2[nH]1)C(F)(F)F)C(F)(F)F
Show InChI InChI=1S/C12H10F6N4O/c13-11(14,15)5-1-6(12(16,17)18)10-7(2-5)21-8(22-10)4-20-9(23)3-19/h1-2H,3-4,19H2,(H,20,23)(H,21,22)
US Patent
n/an/a>1.00E+4n/an/an/an/an/an/a
SRMLSC
US Patent
Assay Description
Cells were plated in 384-well, clear-bottom, black-walled, poly-D-lysine coated plates (Becton Dickinson, Franklin Lake, N.J.) 2 days prior to use in...
US Patent US9688615 (2017)
BindingDB Entry DOI: 10.7270/Q27S7KXH