BDBM164414 US9066954, 40
SMILES: COc1cnc2ccc(Cc3nnc4ccc(nn34)-c3ccccc3)cc2c1
InChI Key: InChIKey=FDLIPQYYLMMQQK-UHFFFAOYSA-N
Data: 1 KI
Activity Spreadsheet -- Enzyme Inhibition Constant Data from BindingDB
Found 1 hit for monomerid = 164414
Trg + Lig
Ki
nM
ΔG°
kcal/mole
IC50
nM
Kd
nM
EC50/IC50
nM
koff
s-1
kon
M-1s-1
pHTemp
°C
Hepatocyte growth factor receptor
(Homo sapiens (Human))
BDBM164414
(US9066954, 40)
Show SMILES COc1cnc2ccc(Cc3nnc4ccc(nn34)-c3ccccc3)cc2c1
Show InChI InChI=1S/C22H17N5O/c1-28-18-13-17-11-15(7-8-19(17)23-14-18)12-22-25-24-21-10-9-20(26-27(21)22)16-5-3-2-4-6-16/h2-11,13-14H,12H2,1H3
US Patent
7.5 -11.2n/an/an/an/an/a8.027
Amgen Inc.
US Patent
Assay Description
A PCR product covering residues 1058-1365 of c-Met (c-Met kinase domain) is generated from Human Liver QuickClone cDNA (Invitrogen) using forward pri...
US Patent US9066954 (2015)
BindingDB Entry DOI: 10.7270/Q2N878JD