BDBM164439 US9066954, 91
SMILES: COc1ccc2c(OCc3nnc4ccc(cn34)C(O)=O)ccnc2c1
InChI Key: InChIKey=RSPDZYUQHNOACI-UHFFFAOYSA-N
Data: 1 KI
Activity Spreadsheet -- Enzyme Inhibition Constant Data from BindingDB
Found 1 hit for monomerid = 164439
Trg + Lig
Ki
nM
ΔG°
kcal/mole
IC50
nM
Kd
nM
EC50/IC50
nM
koff
s-1
kon
M-1s-1
pHTemp
°C
Hepatocyte growth factor receptor
(Homo sapiens (Human))
BDBM164439
(US9066954, 91)
Show SMILES COc1ccc2c(OCc3nnc4ccc(cn34)C(O)=O)ccnc2c1
Show InChI InChI=1S/C18H14N4O4/c1-25-12-3-4-13-14(8-12)19-7-6-15(13)26-10-17-21-20-16-5-2-11(18(23)24)9-22(16)17/h2-9H,10H2,1H3,(H,23,24)
US Patent
19.2 -10.6n/an/an/an/an/a8.027
Amgen Inc.
US Patent
Assay Description
A PCR product covering residues 1058-1365 of c-Met (c-Met kinase domain) is generated from Human Liver QuickClone cDNA (Invitrogen) using forward pri...
US Patent US9066954 (2015)
BindingDB Entry DOI: 10.7270/Q2N878JD