BDBM164459 US9066954, 208
SMILES: COc1ccc2c(OCc3nnc4ccc(nn34)-c3ccc[nH]3)ccnc2c1
InChI Key: InChIKey=ZREYCMCCNLQHMS-UHFFFAOYSA-N
Data: 1 KI
Activity Spreadsheet -- Enzyme Inhibition Constant Data from BindingDB
Found 1 hit for monomerid = 164459
Trg + Lig
Ki
nM
ΔG°
kcal/mole
IC50
nM
Kd
nM
EC50/IC50
nM
koff
s-1
kon
M-1s-1
pHTemp
°C
Hepatocyte growth factor receptor
(Homo sapiens (Human))
BDBM164459
(US9066954, 208)
Show SMILES COc1ccc2c(OCc3nnc4ccc(nn34)-c3ccc[nH]3)ccnc2c1
Show InChI InChI=1S/C20H16N6O2/c1-27-13-4-5-14-17(11-13)22-10-8-18(14)28-12-20-24-23-19-7-6-16(25-26(19)20)15-3-2-9-21-15/h2-11,21H,12H2,1H3
US Patent
23.7 -10.5n/an/an/an/an/a8.027
Amgen Inc.
US Patent
Assay Description
A PCR product covering residues 1058-1365 of c-Met (c-Met kinase domain) is generated from Human Liver QuickClone cDNA (Invitrogen) using forward pri...
US Patent US9066954 (2015)
BindingDB Entry DOI: 10.7270/Q2N878JD