BDBM164465 US9066954, 279
SMILES: COc1ccc2c(OCc3nnc4ccc(cn34)-c3ncc(C)s3)ccnc2c1
InChI Key: InChIKey=OBEXMXPKTBIHED-UHFFFAOYSA-N
Data: 1 KI
Activity Spreadsheet -- Enzyme Inhibition Constant Data from BindingDB
Found 1 hit for monomerid = 164465
Trg + Lig
Ki
nM
ΔG°
kcal/mole
IC50
nM
Kd
nM
EC50/IC50
nM
koff
s-1
kon
M-1s-1
pHTemp
°C
Hepatocyte growth factor receptor
(Homo sapiens (Human))
BDBM164465
(US9066954, 279)
Show SMILES COc1ccc2c(OCc3nnc4ccc(cn34)-c3ncc(C)s3)ccnc2c1
Show InChI InChI=1S/C21H17N5O2S/c1-13-10-23-21(29-13)14-3-6-19-24-25-20(26(19)11-14)12-28-18-7-8-22-17-9-15(27-2)4-5-16(17)18/h3-11H,12H2,1-2H3
US Patent
19.7 -10.6n/an/an/an/an/a8.027
Amgen Inc.
US Patent
Assay Description
A PCR product covering residues 1058-1365 of c-Met (c-Met kinase domain) is generated from Human Liver QuickClone cDNA (Invitrogen) using forward pri...
US Patent US9066954 (2015)
BindingDB Entry DOI: 10.7270/Q2N878JD