BDBM16513 2-(2-chlorophenyl)-6-[(2-chlorophenyl)amino]-2,3-dihydropyridazin-3-one::2-arylpyridazin-3-one, 15
SMILES: Clc1ccccc1Nc1ccc(=O)n(n1)-c1ccccc1Cl
InChI Key: InChIKey=CTCMKHXUZYGYOL-UHFFFAOYSA-N
Data: 2 IC50
PDB links: 1 PDB ID contains this monomer as substructures. 1 PDB ID contains inhibitors having a similarity of 90% to this monomer.
Activity Spreadsheet -- Enzyme Inhibition Constant Data from BindingDB
Found 2 hits for monomerid = 16513
Trg + Lig
Ki
nM
ΔG°
kcal/mole
IC50
nM
Kd
nM
EC50/IC50
nM
koff
s-1
kon
M-1s-1
pHTemp
°C
MAP Kinase p38 beta
(Mus musculus (mouse))
BDBM16513
(2-(2-chlorophenyl)-6-[(2-chlorophenyl)amino]-2,3-d...)
Show SMILES Clc1ccccc1Nc1ccc(=O)n(n1)-c1ccccc1Cl
Show InChI InChI=1S/C16H11Cl2N3O/c17-11-5-1-3-7-13(11)19-15-9-10-16(22)21(20-15)14-8-4-2-6-12(14)18/h1-10H,(H,19,20)
Reactome pathway
n/an/a 990n/an/an/an/an/an/a
Merck Research Laboratories
Assay Description
The biochemical activity of compounds was determined by incubation with p38 enzyme, and substrates in the presence ATP/[gamma-33P] ATP. After the rea...
Bioorg Med Chem Lett 16: 5809-13 (2006)
Article DOI: 10.1016/j.bmcl.2006.08.074
BindingDB Entry DOI: 10.7270/Q28P5XSC
MAP kinase p38
(Mus musculus (mouse))
BDBM16513
(2-(2-chlorophenyl)-6-[(2-chlorophenyl)amino]-2,3-d...)
Show SMILES Clc1ccccc1Nc1ccc(=O)n(n1)-c1ccccc1Cl
Show InChI InChI=1S/C16H11Cl2N3O/c17-11-5-1-3-7-13(11)19-15-9-10-16(22)21(20-15)14-8-4-2-6-12(14)18/h1-10H,(H,19,20)
Reactome pathway
n/an/a 790n/an/an/an/a7.030
Merck Research Laboratories
Assay Description
The biochemical activity of compounds was determined by incubation with p38 enzyme, and substrates in the presence ATP/[gamma-33P] ATP. After the rea...
Bioorg Med Chem Lett 16: 5809-13 (2006)
Article DOI: 10.1016/j.bmcl.2006.08.074
BindingDB Entry DOI: 10.7270/Q28P5XSC