BDBM16524 2-arylpyridazin-3-one, 30::2-{3-[(2-chlorophenyl)[1-(2-chlorophenyl)-6-oxo-1,6-dihydropyridazin-3-yl]amino]propyl}-2,3-dihydro-1H-isoindole-1,3-dione
SMILES: Clc1ccccc1N(CCCN1C(=O)c2ccccc2C1=O)c1ccc(=O)n(n1)-c1ccccc1Cl
InChI Key: InChIKey=QUABQYHYBYAXDR-UHFFFAOYSA-N
Data: 2 IC50
PDB links: 1 PDB ID contains this monomer as substructures. 1 PDB ID contains inhibitors having a similarity of 90% to this monomer.
Activity Spreadsheet -- Enzyme Inhibition Constant Data from BindingDB
Found 2 hits for monomerid = 16524
Trg + Lig
Ki
nM
ΔG°
kcal/mole
IC50
nM
Kd
nM
EC50/IC50
nM
koff
s-1
kon
M-1s-1
pHTemp
°C
MAP Kinase p38 beta
(Mus musculus (mouse))
BDBM16524
(2-arylpyridazin-3-one, 30 | 2-{3-[(2-chlorophenyl)...)
Show SMILES Clc1ccccc1N(CCCN1C(=O)c2ccccc2C1=O)c1ccc(=O)n(n1)-c1ccccc1Cl
Show InChI InChI=1S/C27H20Cl2N4O3/c28-20-10-3-5-12-22(20)31(16-7-17-32-26(35)18-8-1-2-9-19(18)27(32)36)24-14-15-25(34)33(30-24)23-13-6-4-11-21(23)29/h1-6,8-15H,7,16-17H2
Reactome pathway
n/an/a 15n/an/an/an/an/an/a
Merck Research Laboratories
Assay Description
The biochemical activity of compounds was determined by incubation with p38 enzyme, and substrates in the presence ATP/[gamma-33P] ATP. After the rea...
Bioorg Med Chem Lett 16: 5809-13 (2006)
Article DOI: 10.1016/j.bmcl.2006.08.074
BindingDB Entry DOI: 10.7270/Q28P5XSC
MAP kinase p38
(Mus musculus (mouse))
BDBM16524
(2-arylpyridazin-3-one, 30 | 2-{3-[(2-chlorophenyl)...)
Show SMILES Clc1ccccc1N(CCCN1C(=O)c2ccccc2C1=O)c1ccc(=O)n(n1)-c1ccccc1Cl
Show InChI InChI=1S/C27H20Cl2N4O3/c28-20-10-3-5-12-22(20)31(16-7-17-32-26(35)18-8-1-2-9-19(18)27(32)36)24-14-15-25(34)33(30-24)23-13-6-4-11-21(23)29/h1-6,8-15H,7,16-17H2
Reactome pathway
n/an/a 5n/an/an/an/a7.030
Merck Research Laboratories
Assay Description
The biochemical activity of compounds was determined by incubation with p38 enzyme, and substrates in the presence ATP/[gamma-33P] ATP. After the rea...
Bioorg Med Chem Lett 16: 5809-13 (2006)
Article DOI: 10.1016/j.bmcl.2006.08.074
BindingDB Entry DOI: 10.7270/Q28P5XSC