BDBM165340 US9062043, Table 13, Compound 6::US9062043, Table 20b, Compound 4
SMILES: COc1cccc(Nc2nc3cc(ccc3c3cnccc23)C(O)=O)c1
InChI Key: InChIKey=ORFKRAIKKNYTFV-UHFFFAOYSA-N
Data: 3 IC50
Activity Spreadsheet -- Enzyme Inhibition Constant Data from BindingDB
Found 3 hits for monomerid = 165340
Trg + Lig
Ki
nM
ΔG°
kcal/mole
IC50
nM
Kd
nM
EC50/IC50
nM
koff
s-1
kon
M-1s-1
pHTemp
°C
Casein kinase II subunit alpha
(Homo sapiens (Human))
BDBM165340
(US9062043, Table 13, Compound 6 | US9062043, Table...)
Show SMILES COc1cccc(Nc2nc3cc(ccc3c3cnccc23)C(O)=O)c1
Show InChI InChI=1S/C20H15N3O3/c1-26-14-4-2-3-13(10-14)22-19-16-7-8-21-11-17(16)15-6-5-12(20(24)25)9-18(15)23-19/h2-11H,1H3,(H,22,23)(H,24,25)
US Patent
n/an/a 4n/an/an/an/a7.2n/a
SENHWA BIOSCIENCES, INC.
US Patent
Assay Description
Test compounds in aqueous solution were added at a volume of 10 microliters, to a reaction mixture comprising 10 microliters Assay Dilution Buffer (A...
US Patent US9062043 (2015)
BindingDB Entry DOI: 10.7270/Q20G3HWF
Casein kinase II subunit alpha
(Homo sapiens (Human))
BDBM165340
(US9062043, Table 13, Compound 6 | US9062043, Table...)
Show SMILES COc1cccc(Nc2nc3cc(ccc3c3cnccc23)C(O)=O)c1
Show InChI InChI=1S/C20H15N3O3/c1-26-14-4-2-3-13(10-14)22-19-16-7-8-21-11-17(16)15-6-5-12(20(24)25)9-18(15)23-19/h2-11H,1H3,(H,22,23)(H,24,25)
US Patent
n/an/a 2.33E+3n/an/an/an/a7.4n/a
SENHWA BIOSCIENCES, INC.
US Patent
Assay Description
The human leukemia Jurkat T-cell line was maintained in RPMI 1640 (Cambrex) supplemented with 10% fetal calf serum and 50 ng/ml Geutamycin. Before tr...
US Patent US9062043 (2015)
BindingDB Entry DOI: 10.7270/Q20G3HWF
Casein kinase II subunit alpha
(Homo sapiens (Human))
BDBM165340
(US9062043, Table 13, Compound 6 | US9062043, Table...)
Show SMILES COc1cccc(Nc2nc3cc(ccc3c3cnccc23)C(O)=O)c1
Show InChI InChI=1S/C20H15N3O3/c1-26-14-4-2-3-13(10-14)22-19-16-7-8-21-11-17(16)15-6-5-12(20(24)25)9-18(15)23-19/h2-11H,1H3,(H,22,23)(H,24,25)
US Patent
n/an/a 7n/an/an/an/a7.2n/a
SENHWA BIOSCIENCES, INC.
US Patent
Assay Description
Test compounds in aqueous solution were added at a volume of 10 microliters, to a reaction mixture comprising 10 microliters Assay Dilution Buffer (A...
US Patent US9062043 (2015)
BindingDB Entry DOI: 10.7270/Q20G3HWF