BDBM165352 US9062043, Table 13, Compound 19::US9062043, Table 20b, Compound 13
SMILES: OC(=O)c1ccc2c(c1)nc(Nc1cc(F)cc(F)c1)c1ncncc21
InChI Key: InChIKey=JPIYOGKAIULUIO-UHFFFAOYSA-N
Data: 2 IC50
Activity Spreadsheet -- Enzyme Inhibition Constant Data from BindingDB
Found 2 hits for monomerid = 165352
Trg + Lig
Ki
nM
ΔG°
kcal/mole
IC50
nM
Kd
nM
EC50/IC50
nM
koff
s-1
kon
M-1s-1
pHTemp
°C
Casein kinase II subunit alpha
(Homo sapiens (Human))
BDBM165352
(US9062043, Table 13, Compound 19 | US9062043, Tabl...)
Show SMILES OC(=O)c1ccc2c(c1)nc(Nc1cc(F)cc(F)c1)c1ncncc21
Show InChI InChI=1S/C18H10F2N4O2/c19-10-4-11(20)6-12(5-10)23-17-16-14(7-21-8-22-16)13-2-1-9(18(25)26)3-15(13)24-17/h1-8H,(H,23,24)(H,25,26)
US Patent
n/an/a 269n/an/an/an/a7.4n/a
SENHWA BIOSCIENCES, INC.
US Patent
Assay Description
The human leukemia Jurkat T-cell line was maintained in RPMI 1640 (Cambrex) supplemented with 10% fetal calf serum and 50 ng/ml Geutamycin. Before tr...
US Patent US9062043 (2015)
BindingDB Entry DOI: 10.7270/Q20G3HWF
Casein kinase II subunit alpha
(Homo sapiens (Human))
BDBM165352
(US9062043, Table 13, Compound 19 | US9062043, Tabl...)
Show SMILES OC(=O)c1ccc2c(c1)nc(Nc1cc(F)cc(F)c1)c1ncncc21
Show InChI InChI=1S/C18H10F2N4O2/c19-10-4-11(20)6-12(5-10)23-17-16-14(7-21-8-22-16)13-2-1-9(18(25)26)3-15(13)24-17/h1-8H,(H,23,24)(H,25,26)
US Patent
n/an/a 6n/an/an/an/a7.2n/a
SENHWA BIOSCIENCES, INC.
US Patent
Assay Description
Test compounds in aqueous solution were added at a volume of 10 microliters, to a reaction mixture comprising 10 microliters Assay Dilution Buffer (A...
US Patent US9062043 (2015)
BindingDB Entry DOI: 10.7270/Q20G3HWF