BDBM165358 US9062043, Table 13, Compound 25::US9062043, Table 13, Compound 40
SMILES: CNc1ncc2c(n1)c(Nc1ccccc1)nc1cc(ccc21)C(O)=O
InChI Key: InChIKey=KWIKUKWCLKBUMA-UHFFFAOYSA-N
Data: 2 IC50
Activity Spreadsheet -- Enzyme Inhibition Constant Data from BindingDB
Found 2 hits for monomerid = 165358
Trg + Lig
Ki
nM
ΔG°
kcal/mole
IC50
nM
Kd
nM
EC50/IC50
nM
koff
s-1
kon
M-1s-1
pHTemp
°C
Casein kinase II subunit alpha
(Homo sapiens (Human))
BDBM165358
(US9062043, Table 13, Compound 25 | US9062043, Tabl...)
Show SMILES CNc1ncc2c(n1)c(Nc1ccccc1)nc1cc(ccc21)C(O)=O
Show InChI InChI=1S/C19H15N5O2/c1-20-19-21-10-14-13-8-7-11(18(25)26)9-15(13)23-17(16(14)24-19)22-12-5-3-2-4-6-12/h2-10H,1H3,(H,22,23)(H,25,26)(H,20,21,24)
US Patent
n/an/a 18n/an/an/an/a7.2n/a
SENHWA BIOSCIENCES, INC.
US Patent
Assay Description
Test compounds in aqueous solution were added at a volume of 10 microliters, to a reaction mixture comprising 10 microliters Assay Dilution Buffer (A...
US Patent US9062043 (2015)
BindingDB Entry DOI: 10.7270/Q20G3HWF
Casein kinase II subunit alpha
(Homo sapiens (Human))
BDBM165358
(US9062043, Table 13, Compound 25 | US9062043, Tabl...)
Show SMILES CNc1ncc2c(n1)c(Nc1ccccc1)nc1cc(ccc21)C(O)=O
Show InChI InChI=1S/C19H15N5O2/c1-20-19-21-10-14-13-8-7-11(18(25)26)9-15(13)23-17(16(14)24-19)22-12-5-3-2-4-6-12/h2-10H,1H3,(H,22,23)(H,25,26)(H,20,21,24)
US Patent
n/an/a 19n/an/an/an/a7.2n/a
SENHWA BIOSCIENCES, INC.
US Patent
Assay Description
Test compounds in aqueous solution were added at a volume of 10 microliters, to a reaction mixture comprising 10 microliters Assay Dilution Buffer (A...
US Patent US9062043 (2015)
BindingDB Entry DOI: 10.7270/Q20G3HWF