BDBM165366 US9062043, Table 13, Compound 33::US9062043, Table 20b, Compound 24
SMILES: OC(=O)c1ccc2c(c1)nc(Nc1cc(F)cc(F)c1)c1ccncc21
InChI Key: InChIKey=DQIIAHRXAWQFKS-UHFFFAOYSA-N
Data: 2 IC50
Activity Spreadsheet -- Enzyme Inhibition Constant Data from BindingDB
Found 2 hits for monomerid = 165366
Trg + Lig
Ki
nM
ΔG°
kcal/mole
IC50
nM
Kd
nM
EC50/IC50
nM
koff
s-1
kon
M-1s-1
pHTemp
°C
Casein kinase II subunit alpha
(Homo sapiens (Human))
BDBM165366
(US9062043, Table 13, Compound 33 | US9062043, Tabl...)
Show SMILES OC(=O)c1ccc2c(c1)nc(Nc1cc(F)cc(F)c1)c1ccncc21
Show InChI InChI=1S/C19H11F2N3O2/c20-11-6-12(21)8-13(7-11)23-18-15-3-4-22-9-16(15)14-2-1-10(19(25)26)5-17(14)24-18/h1-9H,(H,23,24)(H,25,26)
US Patent
n/an/a 5n/an/an/an/a7.2n/a
SENHWA BIOSCIENCES, INC.
US Patent
Assay Description
Test compounds in aqueous solution were added at a volume of 10 microliters, to a reaction mixture comprising 10 microliters Assay Dilution Buffer (A...
US Patent US9062043 (2015)
BindingDB Entry DOI: 10.7270/Q20G3HWF
Casein kinase II subunit alpha
(Homo sapiens (Human))
BDBM165366
(US9062043, Table 13, Compound 33 | US9062043, Tabl...)
Show SMILES OC(=O)c1ccc2c(c1)nc(Nc1cc(F)cc(F)c1)c1ccncc21
Show InChI InChI=1S/C19H11F2N3O2/c20-11-6-12(21)8-13(7-11)23-18-15-3-4-22-9-16(15)14-2-1-10(19(25)26)5-17(14)24-18/h1-9H,(H,23,24)(H,25,26)
US Patent
n/an/a 1.35E+3n/an/an/an/a7.4n/a
SENHWA BIOSCIENCES, INC.
US Patent
Assay Description
The human leukemia Jurkat T-cell line was maintained in RPMI 1640 (Cambrex) supplemented with 10% fetal calf serum and 50 ng/ml Geutamycin. Before tr...
US Patent US9062043 (2015)
BindingDB Entry DOI: 10.7270/Q20G3HWF