BDBM165367 US9062043, Table 13, Compound 34
SMILES: OC(=O)c1ccc2c(c1)nc(Nc1cccc(c1)C#N)c1ccncc21
InChI Key: InChIKey=LRXAHARGWLKIQK-UHFFFAOYSA-N
Data: 1 IC50
Activity Spreadsheet -- Enzyme Inhibition Constant Data from BindingDB
Found 1 hit for monomerid = 165367
Trg + Lig
Ki
nM
ΔG°
kcal/mole
IC50
nM
Kd
nM
EC50/IC50
nM
koff
s-1
kon
M-1s-1
pHTemp
°C
Casein kinase II subunit alpha
(Homo sapiens (Human))
BDBM165367
(US9062043, Table 13, Compound 34)
Show SMILES OC(=O)c1ccc2c(c1)nc(Nc1cccc(c1)C#N)c1ccncc21
Show InChI InChI=1S/C20H12N4O2/c21-10-12-2-1-3-14(8-12)23-19-16-6-7-22-11-17(16)15-5-4-13(20(25)26)9-18(15)24-19/h1-9,11H,(H,23,24)(H,25,26)
US Patent
n/an/a 4n/an/an/an/a7.2n/a
SENHWA BIOSCIENCES, INC.
US Patent
Assay Description
Test compounds in aqueous solution were added at a volume of 10 microliters, to a reaction mixture comprising 10 microliters Assay Dilution Buffer (A...
US Patent US9062043 (2015)
BindingDB Entry DOI: 10.7270/Q20G3HWF