BDBM165924 US10214524, Example 19::US9067931, 19
SMILES: O=C(N[C@H]1CN2CCC1CC2)c1cc2cccc(-c3ccc(cc3)N3CCOCC3)c2s1
InChI Key: InChIKey=YODBKWMQALJHED-QHCPKHFHSA-N
Data: 2 KI
Activity Spreadsheet -- Enzyme Inhibition Constant Data from BindingDB
Found 2 hits for monomerid = 165924
Trg + Lig
Ki
nM
ΔG°
kcal/mole
IC50
nM
Kd
nM
EC50/IC50
nM
koff
s-1
kon
M-1s-1
pHTemp
°C
Neuronal acetylcholine receptor subunit alpha-7
(Rattus norvegicus (Rat))
BDBM165924
(US10214524, Example 19 | US9067931, 19)
Show SMILES O=C(N[C@H]1CN2CCC1CC2)c1cc2cccc(-c3ccc(cc3)N3CCOCC3)c2s1 |r,wU:3.2,(-2.68,-.16,;-2.68,1.38,;-4.02,2.15,;-5.35,1.38,;-5.35,-.16,;-6.68,-.93,;-8.02,-.16,;-8.02,1.38,;-6.68,2.15,;-5.91,.82,;-7.45,.4,;-1.35,2.15,;-1.19,3.68,;.32,4,;1.09,5.33,;2.63,5.33,;3.4,4,;2.63,2.67,;3.4,1.33,;2.63,,;3.4,-1.33,;4.94,-1.33,;5.71,,;4.94,1.33,;5.71,-2.67,;4.94,-4,;5.71,-5.33,;7.25,-5.33,;8.02,-4,;7.25,-2.67,;1.09,2.67,;.06,1.52,)|
Show InChI InChI=1S/C26H29N3O2S/c30-26(27-23-17-28-10-8-19(23)9-11-28)24-16-20-2-1-3-22(25(20)32-24)18-4-6-21(7-5-18)29-12-14-31-15-13-29/h1-7,16,19,23H,8-15,17H2,(H,27,30)/t23-/m0/s1
Reactome pathway
US Patent
20n/an/an/an/an/an/an/an/a
BAYER INTELLECTUAL PROPERTY GMBH
US Patent
Assay Description
Rat brain tissue (hippocampus or whole brain) is homogenized in homogenization buffer (10% w/v, 0.32 M sucrose, 1 mM EDTA, 0.1 mM phenylmethylsulphon...
US Patent US10214524 (2019)
BindingDB Entry DOI: 10.7270/Q2JH3PF0
Neuronal acetylcholine receptor subunit alpha-7
(Rattus norvegicus (Rat))
BDBM165924
(US10214524, Example 19 | US9067931, 19)
Show SMILES O=C(N[C@H]1CN2CCC1CC2)c1cc2cccc(-c3ccc(cc3)N3CCOCC3)c2s1 |r,wU:3.2,(-2.68,-.16,;-2.68,1.38,;-4.02,2.15,;-5.35,1.38,;-5.35,-.16,;-6.68,-.93,;-8.02,-.16,;-8.02,1.38,;-6.68,2.15,;-5.91,.82,;-7.45,.4,;-1.35,2.15,;-1.19,3.68,;.32,4,;1.09,5.33,;2.63,5.33,;3.4,4,;2.63,2.67,;3.4,1.33,;2.63,,;3.4,-1.33,;4.94,-1.33,;5.71,,;4.94,1.33,;5.71,-2.67,;4.94,-4,;5.71,-5.33,;7.25,-5.33,;8.02,-4,;7.25,-2.67,;1.09,2.67,;.06,1.52,)|
Show InChI InChI=1S/C26H29N3O2S/c30-26(27-23-17-28-10-8-19(23)9-11-28)24-16-20-2-1-3-22(25(20)32-24)18-4-6-21(7-5-18)29-12-14-31-15-13-29/h1-7,16,19,23H,8-15,17H2,(H,27,30)/t23-/m0/s1
Reactome pathway
US Patent
20 -9.76n/an/an/an/an/a7.44
BAYER INTELLECTUAL PROPERTY GMBH
US Patent
Assay Description
The [3H]-methyllycaconitine binding assay is a modification of the method described by Davies et al. in Neuropharmacol. 1999, 38, 679-690.Rat brain t...
US Patent US9067931 (2015)
BindingDB Entry DOI: 10.7270/Q2M907F1