BDBM166306 US9067949, 163
SMILES: COc1cc(cc2c3CNCCc3oc12)S(=O)(=O)c1ccccc1F
InChI Key: InChIKey=DNFVUJJPQOCJEF-UHFFFAOYSA-N
Data: 1 KI
Activity Spreadsheet -- Enzyme Inhibition Constant Data from BindingDB
Found 1 hit for monomerid = 166306
Trg + Lig
Ki
nM
ΔG°
kcal/mole
IC50
nM
Kd
nM
EC50/IC50
nM
koff
s-1
kon
M-1s-1
pHTemp
°C
5-hydroxytryptamine receptor 6
(Homo sapiens (Human))
BDBM166306
(US9067949, 163)
Show SMILES COc1cc(cc2c3CNCCc3oc12)S(=O)(=O)c1ccccc1F
Show InChI InChI=1S/C18H16FNO4S/c1-23-16-9-11(25(21,22)17-5-3-2-4-14(17)19)8-12-13-10-20-7-6-15(13)24-18(12)16/h2-5,8-9,20H,6-7,10H2,1H3
Reactome pathway
US Patent
0.190 -13.3n/an/an/an/an/a7.525
Albany Molecular Research, Inc.
US Patent
Assay Description
For binding analysis vs. the human receptor, samples were incubated in 50 mM Tris-HCl, pH 7.5, 5 mM MgCl2, 1 mM EDTA (4% DMSO final) with 10 nM [N-me...
US Patent US9067949 (2015)
BindingDB Entry DOI: 10.7270/Q23777FB