BDBM16727 N-{5-bromo-2-[4-(2-hydroxyethyl)piperazin-1-yl]phenyl}naphthalene-1-carboxamide::Naphthyl Compound, 3e
SMILES: OCCN1CCN(CC1)c1ccc(Br)cc1NC(=O)c1cccc2ccccc12
InChI Key: InChIKey=ZCKPVEIERKHFSL-UHFFFAOYSA-N
Data: 2 IC50
Activity Spreadsheet -- Enzyme Inhibition Constant Data from BindingDB
Found 2 hits for monomerid = 16727
Trg + Lig
Ki
nM
ΔG°
kcal/mole
IC50
nM
Kd
nM
EC50/IC50
nM
koff
s-1
kon
M-1s-1
pHTemp
°C
Beta-secretase 1
(Homo sapiens (Human))
BDBM16727
(N-{5-bromo-2-[4-(2-hydroxyethyl)piperazin-1-yl]phe...)
Show SMILES OCCN1CCN(CC1)c1ccc(Br)cc1NC(=O)c1cccc2ccccc12
Show InChI InChI=1S/C23H24BrN3O2/c24-18-8-9-22(27-12-10-26(11-13-27)14-15-28)21(16-18)25-23(29)20-7-3-5-17-4-1-2-6-19(17)20/h1-9,16,28H,10-15H2,(H,25,29)
n/an/a 79n/an/an/an/an/an/a
Applied Science University
Curated by ChEMBL
Assay Description
Inhibition of BACE1 after 2 hrs by FRET assay
Bioorg Med Chem 18: 3088-115 (2010)
Article DOI: 10.1016/j.bmc.2010.03.043
BindingDB Entry DOI: 10.7270/Q2ZG6SFR
Beta-secretase 1
(Homo sapiens (Human))
BDBM16727
(N-{5-bromo-2-[4-(2-hydroxyethyl)piperazin-1-yl]phe...)
Show SMILES OCCN1CCN(CC1)c1ccc(Br)cc1NC(=O)c1cccc2ccccc12
Show InChI InChI=1S/C23H24BrN3O2/c24-18-8-9-22(27-12-10-26(11-13-27)14-15-28)21(16-18)25-23(29)20-7-3-5-17-4-1-2-6-19(17)20/h1-9,16,28H,10-15H2,(H,25,29)
n/an/a 79n/an/an/an/a7.525
Universite de la Mediterranee
Assay Description
These experiments have been preformed using BACE-1 FRET assay kit (PanVera Corporation, Madison, WI), using a multiwell spectrofluorometer instrument...
J Med Chem 49: 4275-85 (2006)
Article DOI: 10.1021/jm0602864
BindingDB Entry DOI: 10.7270/Q2QN651G