BDBM16733 4-[1-(5-Amino)-pentyl]-1-{4-(phenyl)-2-[(naphthalene-1-carbonyl)-amino]-phenyl}-piperazine::N-{2-[4-(5-aminopentyl)piperazin-1-yl]-5-phenylphenyl}naphthalene-1-carboxamide::Naphthyl Compound, 5d
SMILES: NCCCCCN1CCN(CC1)c1ccc(cc1NC(=O)c1cccc2ccccc12)-c1ccccc1
InChI Key: InChIKey=PZHWVACDFBHKQI-UHFFFAOYSA-N
Data: 2 IC50
Activity Spreadsheet -- Enzyme Inhibition Constant Data from BindingDB
Found 2 hits for monomerid = 16733
Trg + Lig
Ki
nM
ΔG°
kcal/mole
IC50
nM
Kd
nM
EC50/IC50
nM
koff
s-1
kon
M-1s-1
pHTemp
°C
Beta-secretase 1
(Homo sapiens (Human))
BDBM16733
(4-[1-(5-Amino)-pentyl]-1-{4-(phenyl)-2-[(naphthale...)
Show SMILES NCCCCCN1CCN(CC1)c1ccc(cc1NC(=O)c1cccc2ccccc12)-c1ccccc1
Show InChI InChI=1S/C32H36N4O/c33-18-7-2-8-19-35-20-22-36(23-21-35)31-17-16-27(25-10-3-1-4-11-25)24-30(31)34-32(37)29-15-9-13-26-12-5-6-14-28(26)29/h1,3-6,9-17,24H,2,7-8,18-23,33H2,(H,34,37)
n/an/a 68n/an/an/an/an/an/a
Applied Science University
Curated by ChEMBL
Assay Description
Inhibition of BACE1 after 2 hrs by FRET assay
Bioorg Med Chem 18: 3088-115 (2010)
Article DOI: 10.1016/j.bmc.2010.03.043
BindingDB Entry DOI: 10.7270/Q2ZG6SFR
Beta-secretase 1
(Homo sapiens (Human))
BDBM16733
(4-[1-(5-Amino)-pentyl]-1-{4-(phenyl)-2-[(naphthale...)
Show SMILES NCCCCCN1CCN(CC1)c1ccc(cc1NC(=O)c1cccc2ccccc12)-c1ccccc1
Show InChI InChI=1S/C32H36N4O/c33-18-7-2-8-19-35-20-22-36(23-21-35)31-17-16-27(25-10-3-1-4-11-25)24-30(31)34-32(37)29-15-9-13-26-12-5-6-14-28(26)29/h1,3-6,9-17,24H,2,7-8,18-23,33H2,(H,34,37)
n/an/a 68n/an/an/an/a7.525
Universite de la Mediterranee
Assay Description
These experiments have been preformed using BACE-1 FRET assay kit (PanVera Corporation, Madison, WI), using a multiwell spectrofluorometer instrument...
J Med Chem 49: 4275-85 (2006)
Article DOI: 10.1021/jm0602864
BindingDB Entry DOI: 10.7270/Q2QN651G