null
SMILES: Clc1ccc(cc1)-c1cc([nH]n1)C(=O)Nc1ccc(cc1)[C@@H]1CNCCO1
InChI Key:
Activity Spreadsheet -- Enzyme Inhibition Constant Data from BindingDB
Found 2 hits for monomerid = 167463
Trg + Lig
Ki
nM
ΔG°
kcal/mole
IC50
nM
Kd
nM
EC50/IC50
nM
koff
s-1
kon
M-1s-1
pHTemp
°C
Trace amine-associated receptor 1
(Rattus norvegicus (Rat))
BDBM167463
(US9073911, 12)
Show SMILES Clc1ccc(cc1)-c1cc([nH]n1)C(=O)Nc1ccc(cc1)[C@@H]1CNCCO1 |r|
Reactome pathway
US Patent
0.400n/an/an/an/an/an/a7.4n/a
HOFFMANN-LA ROCHE INC.
US Patent
Assay Description
The TAAR1 radioligand 3[H](S)-4-[(ethyl-phenyl-amino)-methyl]-4,5-dihydro-oxazol-2-ylamine (described in WO 2008/098857) was used at a concentration ...
US Patent US9073911 (2015)
BindingDB Entry DOI: 10.7270/Q2N29VPX
Trace amine-associated receptor 1
(Mus musculus (Mouse))
BDBM167463
(US9073911, 12)
Show SMILES Clc1ccc(cc1)-c1cc([nH]n1)C(=O)Nc1ccc(cc1)[C@@H]1CNCCO1 |r|
Reactome pathway
US Patent
0.5n/an/an/an/an/an/a7.4n/a
HOFFMANN-LA ROCHE INC.
US Patent
Assay Description
The TAAR1 radioligand 3[H](S)-4-[(ethyl-phenyl-amino)-methyl]-4,5-dihydro-oxazol-2-ylamine (described in WO 2008/098857) was used at a concentration ...
US Patent US9073911 (2015)
BindingDB Entry DOI: 10.7270/Q2N29VPX