BDBM167511 US9073917, 8- comparative
SMILES: CCc1[nH]cc2C(C3=C(CC(C)(C)CC3=O)Nc12)c1cccc(Sc2nc3ccccc3[nH]2)c1
InChI Key:
Data: 2 IC50
Activity Spreadsheet -- Enzyme Inhibition Constant Data from BindingDB
Found 2 hits for monomerid = 167511
Trg + Lig
Ki
nM
ΔG°
kcal/mole
IC50
nM
Kd
nM
EC50/IC50
nM
koff
s-1
kon
M-1s-1
pHTemp
°C
Aurora kinase A
(Homo sapiens (Human))
BDBM167511
(US9073917, 8- comparative)
Show SMILES CCc1[nH]cc2C(C3=C(CC(C)(C)CC3=O)Nc12)c1cccc(Sc2nc3ccccc3[nH]2)c1 |t:7|
NCI pathway
Reactome pathway
US Patent
n/an/a 102n/an/an/an/an/an/a
SANOFI
US Patent
Assay Description
The capacity to inhibit the kinase activity of the enzyme is estimated by measuring the residual kinase activity of the enzyme in the presence of dif...
US Patent US9073917 (2015)
BindingDB Entry DOI: 10.7270/Q2H993X4
Aurora B/Incenp
(Homo sapiens (Human))
BDBM167511
(US9073917, 8- comparative)
Show SMILES CCc1[nH]cc2C(C3=C(CC(C)(C)CC3=O)Nc12)c1cccc(Sc2nc3ccccc3[nH]2)c1 |t:7|
US Patent
n/an/a 21n/an/an/an/an/an/a
SANOFI
US Patent
Assay Description
The capacity to inhibit the kinase activity of the enzyme is estimated by measuring the residual kinase activity of the enzyme in the presence of dif...
US Patent US9073917 (2015)
BindingDB Entry DOI: 10.7270/Q2H993X4