null
SMILES: COc1ccc(cc1)N1CCN(CC(O)COc2ncnc3ccccc23)CC1
InChI Key: InChIKey=UGSJIBBLYLHNRN-UHFFFAOYSA-N
Activity Spreadsheet -- Enzyme Inhibition Constant Data from BindingDB
Found 4 hits for monomerid = 167953
Trg + Lig
Ki
nM
ΔG°
kcal/mole
IC50
nM
Kd
nM
EC50/IC50
nM
koff
s-1
kon
M-1s-1
pHTemp
°C
Vascular endothelial growth factor receptor 2
(Homo sapiens (Human))
BDBM167953
(1-(4-(4-Methoxyphenyl)piperazin-1-yl)-3-(quinazoli...)
Show SMILES COc1ccc(cc1)N1CCN(CC(O)COc2ncnc3ccccc23)CC1
Show InChI InChI=1S/C22H26N4O3/c1-28-19-8-6-17(7-9-19)26-12-10-25(11-13-26)14-18(27)15-29-22-20-4-2-3-5-21(20)23-16-24-22/h2-9,16,18,27H,10-15H2,1H3
NCI pathway
Reactome pathway
n/an/a 3.42n/an/an/an/a7.225
Nanjing University
Assay Description
VEGFR kinase assays were set up to assess the level of autophosphorylation based on DELFIA/Time-Resolved Fluorometry. 96-well plates were coated at r...
Chem Biol Drug Des 86: 1323-9 (2015)
Article DOI: 10.1111/cbdd.12596
BindingDB Entry DOI: 10.7270/Q2GB22TR
Platelet-derived growth factor receptor beta
(Homo sapiens (Human))
BDBM167953
(1-(4-(4-Methoxyphenyl)piperazin-1-yl)-3-(quinazoli...)
Show SMILES COc1ccc(cc1)N1CCN(CC(O)COc2ncnc3ccccc23)CC1
Show InChI InChI=1S/C22H26N4O3/c1-28-19-8-6-17(7-9-19)26-12-10-25(11-13-26)14-18(27)15-29-22-20-4-2-3-5-21(20)23-16-24-22/h2-9,16,18,27H,10-15H2,1H3
NCI pathway
Reactome pathway
n/an/a 62.7n/an/an/an/a7.225
Nanjing University
Assay Description
VEGFR kinase assays were set up to assess the level of autophosphorylation based on DELFIA/Time-Resolved Fluorometry. 96-well plates were coated at r...
Chem Biol Drug Des 86: 1323-9 (2015)
Article DOI: 10.1111/cbdd.12596
BindingDB Entry DOI: 10.7270/Q2GB22TR
Fibroblast growth factor 2
(Homo sapiens (Human))
BDBM167953
(1-(4-(4-Methoxyphenyl)piperazin-1-yl)-3-(quinazoli...)
Show SMILES COc1ccc(cc1)N1CCN(CC(O)COc2ncnc3ccccc23)CC1
Show InChI InChI=1S/C22H26N4O3/c1-28-19-8-6-17(7-9-19)26-12-10-25(11-13-26)14-18(27)15-29-22-20-4-2-3-5-21(20)23-16-24-22/h2-9,16,18,27H,10-15H2,1H3
Reactome pathway
n/an/a 122n/an/an/an/a7.225
Nanjing University
Assay Description
VEGFR kinase assays were set up to assess the level of autophosphorylation based on DELFIA/Time-Resolved Fluorometry. 96-well plates were coated at r...
Chem Biol Drug Des 86: 1323-9 (2015)
Article DOI: 10.1111/cbdd.12596
BindingDB Entry DOI: 10.7270/Q2GB22TR
Epidermal growth factor receptor
(Homo sapiens (Human))
BDBM167953
(1-(4-(4-Methoxyphenyl)piperazin-1-yl)-3-(quinazoli...)
Show SMILES COc1ccc(cc1)N1CCN(CC(O)COc2ncnc3ccccc23)CC1
Show InChI InChI=1S/C22H26N4O3/c1-28-19-8-6-17(7-9-19)26-12-10-25(11-13-26)14-18(27)15-29-22-20-4-2-3-5-21(20)23-16-24-22/h2-9,16,18,27H,10-15H2,1H3
n/an/a 276n/an/an/an/a7.225
Nanjing University
Assay Description
VEGFR kinase assays were set up to assess the level of autophosphorylation based on DELFIA/Time-Resolved Fluorometry. 96-well plates were coated at r...
Chem Biol Drug Des 86: 1323-9 (2015)
Article DOI: 10.1111/cbdd.12596
BindingDB Entry DOI: 10.7270/Q2GB22TR