BDBM167965 1-(2-Methyl-1H-imidazol-1-yl)-3-(quinazolin-4-yloxy)propan-2-ol (3u)
SMILES: Cc1nccn1CC(O)COc1ncnc2ccccc12
InChI Key: InChIKey=XTCMHHNUPIPYQB-UHFFFAOYSA-N
Data: 4 IC50
Activity Spreadsheet -- Enzyme Inhibition Constant Data from BindingDB
Found 4 hits for monomerid = 167965
Trg + Lig
Ki
nM
ΔG°
kcal/mole
IC50
nM
Kd
nM
EC50/IC50
nM
koff
s-1
kon
M-1s-1
pHTemp
°C
Vascular endothelial growth factor receptor 2
(Homo sapiens (Human))
BDBM167965
(1-(2-Methyl-1H-imidazol-1-yl)-3-(quinazolin-4-ylox...)
Show SMILES Cc1nccn1CC(O)COc1ncnc2ccccc12
Show InChI InChI=1S/C15H16N4O2/c1-11-16-6-7-19(11)8-12(20)9-21-15-13-4-2-3-5-14(13)17-10-18-15/h2-7,10,12,20H,8-9H2,1H3
NCI pathway
Reactome pathway
n/an/a 55.7n/an/an/an/a7.225
Nanjing University
Assay Description
VEGFR kinase assays were set up to assess the level of autophosphorylation based on DELFIA/Time-Resolved Fluorometry. 96-well plates were coated at r...
Chem Biol Drug Des 86: 1323-9 (2015)
Article DOI: 10.1111/cbdd.12596
BindingDB Entry DOI: 10.7270/Q2GB22TR
Platelet-derived growth factor receptor beta
(Homo sapiens (Human))
BDBM167965
(1-(2-Methyl-1H-imidazol-1-yl)-3-(quinazolin-4-ylox...)
Show SMILES Cc1nccn1CC(O)COc1ncnc2ccccc12
Show InChI InChI=1S/C15H16N4O2/c1-11-16-6-7-19(11)8-12(20)9-21-15-13-4-2-3-5-14(13)17-10-18-15/h2-7,10,12,20H,8-9H2,1H3
NCI pathway
Reactome pathway
n/an/a 266n/an/an/an/a7.225
Nanjing University
Assay Description
VEGFR kinase assays were set up to assess the level of autophosphorylation based on DELFIA/Time-Resolved Fluorometry. 96-well plates were coated at r...
Chem Biol Drug Des 86: 1323-9 (2015)
Article DOI: 10.1111/cbdd.12596
BindingDB Entry DOI: 10.7270/Q2GB22TR
Fibroblast growth factor 2
(Homo sapiens (Human))
BDBM167965
(1-(2-Methyl-1H-imidazol-1-yl)-3-(quinazolin-4-ylox...)
Show SMILES Cc1nccn1CC(O)COc1ncnc2ccccc12
Show InChI InChI=1S/C15H16N4O2/c1-11-16-6-7-19(11)8-12(20)9-21-15-13-4-2-3-5-14(13)17-10-18-15/h2-7,10,12,20H,8-9H2,1H3
Reactome pathway
n/an/a 586n/an/an/an/a7.225
Nanjing University
Assay Description
VEGFR kinase assays were set up to assess the level of autophosphorylation based on DELFIA/Time-Resolved Fluorometry. 96-well plates were coated at r...
Chem Biol Drug Des 86: 1323-9 (2015)
Article DOI: 10.1111/cbdd.12596
BindingDB Entry DOI: 10.7270/Q2GB22TR
Epidermal growth factor receptor
(Homo sapiens (Human))
BDBM167965
(1-(2-Methyl-1H-imidazol-1-yl)-3-(quinazolin-4-ylox...)
Show SMILES Cc1nccn1CC(O)COc1ncnc2ccccc12
Show InChI InChI=1S/C15H16N4O2/c1-11-16-6-7-19(11)8-12(20)9-21-15-13-4-2-3-5-14(13)17-10-18-15/h2-7,10,12,20H,8-9H2,1H3
n/an/a 444n/an/an/an/a7.225
Nanjing University
Assay Description
VEGFR kinase assays were set up to assess the level of autophosphorylation based on DELFIA/Time-Resolved Fluorometry. 96-well plates were coated at r...
Chem Biol Drug Des 86: 1323-9 (2015)
Article DOI: 10.1111/cbdd.12596
BindingDB Entry DOI: 10.7270/Q2GB22TR