null
SMILES: N[C@H](COc1cncc(c1)-c1cc2c(n[nH]c2cn1)-c1ccccc1)Cc1ccccc1
InChI Key: InChIKey=NEHWSPJUDZLKNN-NRFANRHFSA-N
Activity Spreadsheet -- Enzyme Inhibition Constant Data from BindingDB
Found 2 hits for monomerid = 16797
Trg + Lig
Ki
nM
ΔG°
kcal/mole
IC50
nM
Kd
nM
EC50/IC50
nM
koff
s-1
kon
M-1s-1
pHTemp
°C
cAMP-dependent protein kinase catalytic subunit alpha
(Bos taurus (bovine))
BDBM16797
(3-[(2S)-2-amino-3-phenylpropoxy]-5-{3-phenyl-1H-py...)
Show SMILES N[C@H](COc1cncc(c1)-c1cc2c(n[nH]c2cn1)-c1ccccc1)Cc1ccccc1 |r|
Show InChI InChI=1S/C26H23N5O/c27-21(11-18-7-3-1-4-8-18)17-32-22-12-20(14-28-15-22)24-13-23-25(16-29-24)30-31-26(23)19-9-5-2-6-10-19/h1-10,12-16,21H,11,17,27H2,(H,30,31)/t21-/m0/s1
n/an/a 371n/an/an/an/an/an/a
Abbott Laboratories
Assay Description
The kinase assay uses purified recombinant enzyme and a biotinylated peptide as substrate. The biotinylated peptides were immobilized on streptavidi...
Bioorg Med Chem 15: 2441-52 (2007)
Article DOI: 10.1016/j.bmc.2007.01.010
BindingDB Entry DOI: 10.7270/Q26Q1VGQ
RAC-alpha serine/threonine-protein kinase [139-480,S378A,S381A,T450D,S473D]
(Homo sapiens (Human))
BDBM16797
(3-[(2S)-2-amino-3-phenylpropoxy]-5-{3-phenyl-1H-py...)
Show SMILES N[C@H](COc1cncc(c1)-c1cc2c(n[nH]c2cn1)-c1ccccc1)Cc1ccccc1 |r|
Show InChI InChI=1S/C26H23N5O/c27-21(11-18-7-3-1-4-8-18)17-32-22-12-20(14-28-15-22)24-13-23-25(16-29-24)30-31-26(23)19-9-5-2-6-10-19/h1-10,12-16,21H,11,17,27H2,(H,30,31)/t21-/m0/s1
n/an/a 8.30n/an/an/an/a7.522
Abbott Laboratories
Assay Description
The kinase assay uses His-Akt1 and a biotinylated peptide as substrate. The biotinylated peptides were immobilized on streptavidin-coated FLASH plat...
Bioorg Med Chem 15: 2441-52 (2007)
Article DOI: 10.1016/j.bmc.2007.01.010
BindingDB Entry DOI: 10.7270/Q26Q1VGQ