null
SMILES: CN1CCCC2(C1)NC(=O)c1c(C)cc(Nc3ccncn3)c(=O)n21
InChI Key: InChIKey=CLZFXJFITWSDML-UHFFFAOYSA-N
Activity Spreadsheet -- Enzyme Inhibition Constant Data from BindingDB
Found 2 hits for monomerid = 168304
Trg + Lig
Ki
nM
ΔG°
kcal/mole
IC50
nM
Kd
nM
EC50/IC50
nM
koff
s-1
kon
M-1s-1
pHTemp
°C
MAP kinase-interacting serine/threonine-protein kinase 2
(Homo sapiens (Human))
BDBM168304
(US9669031, 130 1′,8-dimethyl-6-(pyrimidin-4-...)
Show SMILES CN1CCCC2(C1)NC(=O)c1c(C)cc(Nc3ccncn3)c(=O)n21
Show InChI InChI=1S/C17H20N6O2/c1-11-8-12(20-13-4-6-18-10-19-13)16(25)23-14(11)15(24)21-17(23)5-3-7-22(2)9-17/h4,6,8,10H,3,5,7,9H2,1-2H3,(H,21,24)(H,18,19,20)
US Patent
n/an/a 55n/an/an/an/an/a25
eFFECTOR THERAPEUTICS, INC.
US Patent
Assay Description
Compounds are screened for Mnk inhibition using the ADP-Glo kinase assay kit (Promega, catalogue No. V9101). All kinase reactions are performed in Re...
US Patent US9669031 (2017)
BindingDB Entry DOI: 10.7270/Q26Q1VDT
MAP kinase-interacting serine/threonine-protein kinase 1
(Homo sapiens (Human))
BDBM168304
(US9669031, 130 1′,8-dimethyl-6-(pyrimidin-4-...)
Show SMILES CN1CCCC2(C1)NC(=O)c1c(C)cc(Nc3ccncn3)c(=O)n21
Show InChI InChI=1S/C17H20N6O2/c1-11-8-12(20-13-4-6-18-10-19-13)16(25)23-14(11)15(24)21-17(23)5-3-7-22(2)9-17/h4,6,8,10H,3,5,7,9H2,1-2H3,(H,21,24)(H,18,19,20)
NCI pathway
Reactome pathway
US Patent
n/an/a<10n/an/an/an/an/a25
eFFECTOR THERAPEUTICS, INC.
US Patent
Assay Description
Compounds are screened for Mnk inhibition using the ADP-Glo kinase assay kit (Promega, catalogue No. V9101). All kinase reactions are performed in Re...
US Patent US9669031 (2017)
BindingDB Entry DOI: 10.7270/Q26Q1VDT