BDBM168387 US9669034, 6 (rac)-4-[2-(Benzyloxy)-4-fluorophenyl]-N-{3-[(S-methylsulfonimidoyl)methyl]phenyl}-1,3,5-triazin-2-amine::US9669034, 62 (rac)-4-(4-Fluoro-2-{[(2H5)phenyl(2H2)methyl]oxy}phenyl)-N-{3-[(S-methylsulfonimidoyl)methyl]phenyl}-1,3,5-triazin-2-amine
SMILES: CS(=N)(=O)Cc1cccc(Nc2ncnc(n2)-c2ccc(F)cc2OCc2ccccc2)c1
InChI Key: InChIKey=KEAPAIZOLSVRNZ-UHFFFAOYSA-N
Data: 4 IC50
Activity Spreadsheet -- Enzyme Inhibition Constant Data from BindingDB
Found 4 hits for monomerid = 168387
Trg + Lig
Ki
nM
ΔG°
kcal/mole
IC50
nM
Kd
nM
EC50/IC50
nM
koff
s-1
kon
M-1s-1
pHTemp
°C
Cyclin-Dependent Kinase 9 (CDK9)
(Homo sapiens (Human))
BDBM168387
(US9669034, 6 (rac)-4-[2-(Benzyloxy)-4-fluorophenyl...)
Show SMILES CS(=N)(=O)Cc1cccc(Nc2ncnc(n2)-c2ccc(F)cc2OCc2ccccc2)c1
Show InChI InChI=1S/C24H22FN5O2S/c1-33(26,31)15-18-8-5-9-20(12-18)29-24-28-16-27-23(30-24)21-11-10-19(25)13-22(21)32-14-17-6-3-2-4-7-17/h2-13,16,26H,14-15H2,1H3,(H,27,28,29,30)
Reactome pathway
US Patent
n/an/a 3n/an/an/an/a8.022
BAYER INTELLECTUAL PROPERTY GMBH
US Patent
Assay Description
For the assay 50 nl of a 100 fold concentrated solution of the test compound in DMSO was pipetted into a black low volume 384 well microtiter plate (...
US Patent US9669034 (2017)
BindingDB Entry DOI: 10.7270/Q22Z13PG
CDK2/CycE
(Homo sapiens (Human))
BDBM168387
(US9669034, 6 (rac)-4-[2-(Benzyloxy)-4-fluorophenyl...)
Show SMILES CS(=N)(=O)Cc1cccc(Nc2ncnc(n2)-c2ccc(F)cc2OCc2ccccc2)c1
Show InChI InChI=1S/C24H22FN5O2S/c1-33(26,31)15-18-8-5-9-20(12-18)29-24-28-16-27-23(30-24)21-11-10-19(25)13-22(21)32-14-17-6-3-2-4-7-17/h2-13,16,26H,14-15H2,1H3,(H,27,28,29,30)
US Patent
n/an/a 220n/an/an/an/a8.022
BAYER INTELLECTUAL PROPERTY GMBH
US Patent
Assay Description
For the assay 50 nl of a 100 fold concentrated solution of the test compound in DMSO was pipetted into a black low volume 384 well microtiter plate (...
US Patent US9669034 (2017)
BindingDB Entry DOI: 10.7270/Q22Z13PG
Cyclin-Dependent Kinase 9 (CDK9)
(Homo sapiens (Human))
BDBM168387
(US9669034, 6 (rac)-4-[2-(Benzyloxy)-4-fluorophenyl...)
Show SMILES CS(=N)(=O)Cc1cccc(Nc2ncnc(n2)-c2ccc(F)cc2OCc2ccccc2)c1
Show InChI InChI=1S/C24H22FN5O2S/c1-33(26,31)15-18-8-5-9-20(12-18)29-24-28-16-27-23(30-24)21-11-10-19(25)13-22(21)32-14-17-6-3-2-4-7-17/h2-13,16,26H,14-15H2,1H3,(H,27,28,29,30)
Reactome pathway
US Patent
n/an/a 7n/an/an/an/a8.022
BAYER INTELLECTUAL PROPERTY GMBH
US Patent
Assay Description
For the assay 50 nl of a 100 fold concentrated solution of the test compound in DMSO was pipetted into a black low volume 384 well microtiter plate (...
US Patent US9669034 (2017)
BindingDB Entry DOI: 10.7270/Q22Z13PG
CDK2/CycE
(Homo sapiens (Human))
BDBM168387
(US9669034, 6 (rac)-4-[2-(Benzyloxy)-4-fluorophenyl...)
Show SMILES CS(=N)(=O)Cc1cccc(Nc2ncnc(n2)-c2ccc(F)cc2OCc2ccccc2)c1
Show InChI InChI=1S/C24H22FN5O2S/c1-33(26,31)15-18-8-5-9-20(12-18)29-24-28-16-27-23(30-24)21-11-10-19(25)13-22(21)32-14-17-6-3-2-4-7-17/h2-13,16,26H,14-15H2,1H3,(H,27,28,29,30)
US Patent
n/an/a 220n/an/an/an/a8.022
BAYER INTELLECTUAL PROPERTY GMBH
US Patent
Assay Description
For the assay 50 nl of a 100 fold concentrated solution of the test compound in DMSO was pipetted into a black low volume 384 well microtiter plate (...
US Patent US9669034 (2017)
BindingDB Entry DOI: 10.7270/Q22Z13PG