BDBM16843 (2S)-3-{4-[(3,5-dichloropyridine-4-)amido]phenyl}-2-{[(3S)-2-(3-phenylpropanoyl)-2-azabicyclo[2.2.2]octan-3-yl]formamido}propanoic acid::azabicyclo[2.2.2]octane derivative, 28
SMILES: OC(=O)[C@H](Cc1ccc(NC(=O)c2c(Cl)cncc2Cl)cc1)NC(=O)[C@@H]1C2CCC(CC2)N1C(=O)CCc1ccccc1
InChI Key: InChIKey=GYVVEAHUBGTOQA-NQIQJBCUSA-N
Data: 2 IC50
Activity Spreadsheet -- Enzyme Inhibition Constant Data from BindingDB
Found 2 hits for monomerid = 16843
Trg + Lig
Ki
nM
ΔG°
kcal/mole
IC50
nM
Kd
nM
EC50/IC50
nM
koff
s-1
kon
M-1s-1
pHTemp
°C
Integrin alpha-4/beta-7
(Homo sapiens (Human))
BDBM16843
((2S)-3-{4-[(3,5-dichloropyridine-4-)amido]phenyl}-...)
Show SMILES OC(=O)[C@H](Cc1ccc(NC(=O)c2c(Cl)cncc2Cl)cc1)NC(=O)[C@@H]1C2CCC(CC2)N1C(=O)CCc1ccccc1 |r,wU:25.26,3.23,TLB:23:25:27.28:31.30,THB:33:32:27.28:31.30,(18.76,-8,;17.43,-8.77,;17.43,-10.31,;16.1,-8,;16.1,-6.46,;17.43,-5.69,;17.43,-4.15,;18.76,-3.38,;20.1,-4.15,;21.43,-3.38,;22.77,-4.15,;22.77,-5.69,;24.1,-3.38,;24.13,-1.84,;22.82,-1.04,;25.48,-1.1,;26.8,-1.9,;26.77,-3.44,;25.42,-4.18,;25.38,-5.72,;20.1,-5.69,;18.76,-6.46,;14.76,-8.77,;13.43,-8,;13.43,-6.46,;12.1,-8.77,;10.76,-8,;10.76,-6.46,;11.25,-7.34,;11.25,-8.88,;9.91,-9.65,;9.43,-8.77,;12.58,-9.65,;12.58,-11.19,;13.91,-11.96,;11.25,-11.96,;11.25,-13.5,;9.91,-14.27,;8.58,-13.5,;7.25,-14.27,;7.25,-15.81,;8.58,-16.58,;9.91,-15.81,)|
Show InChI InChI=1S/C32H32Cl2N4O5/c33-24-17-35-18-25(34)28(24)30(40)36-22-11-6-20(7-12-22)16-26(32(42)43)37-31(41)29-21-9-13-23(14-10-21)38(29)27(39)15-8-19-4-2-1-3-5-19/h1-7,11-12,17-18,21,23,26,29H,8-10,13-16H2,(H,36,40)(H,37,41)(H,42,43)/t21?,23?,26-,29-/m0/s1
n/an/a 7n/an/an/an/an/a4
Johnson & Johnson Pharmaceutical
Assay Description
M2 anti-FLAG antibody coated 96-well plates were coated with recombinant FLAG-hMAdCAM-1 contained in Dulbecco PBS. The compounds to be tested were ad...
Bioorg Med Chem 13: 6693-702 (2005)
Article DOI: 10.1016/j.bmc.2005.07.022
BindingDB Entry DOI: 10.7270/Q2TD9VM1
Integrin alpha-4/beta-1 [T112H]
(Homo sapiens (Human))
BDBM16843
((2S)-3-{4-[(3,5-dichloropyridine-4-)amido]phenyl}-...)
Show SMILES OC(=O)[C@H](Cc1ccc(NC(=O)c2c(Cl)cncc2Cl)cc1)NC(=O)[C@@H]1C2CCC(CC2)N1C(=O)CCc1ccccc1 |r,wU:25.26,3.23,TLB:23:25:27.28:31.30,THB:33:32:27.28:31.30,(18.76,-8,;17.43,-8.77,;17.43,-10.31,;16.1,-8,;16.1,-6.46,;17.43,-5.69,;17.43,-4.15,;18.76,-3.38,;20.1,-4.15,;21.43,-3.38,;22.77,-4.15,;22.77,-5.69,;24.1,-3.38,;24.13,-1.84,;22.82,-1.04,;25.48,-1.1,;26.8,-1.9,;26.77,-3.44,;25.42,-4.18,;25.38,-5.72,;20.1,-5.69,;18.76,-6.46,;14.76,-8.77,;13.43,-8,;13.43,-6.46,;12.1,-8.77,;10.76,-8,;10.76,-6.46,;11.25,-7.34,;11.25,-8.88,;9.91,-9.65,;9.43,-8.77,;12.58,-9.65,;12.58,-11.19,;13.91,-11.96,;11.25,-11.96,;11.25,-13.5,;9.91,-14.27,;8.58,-13.5,;7.25,-14.27,;7.25,-15.81,;8.58,-16.58,;9.91,-15.81,)|
Show InChI InChI=1S/C32H32Cl2N4O5/c33-24-17-35-18-25(34)28(24)30(40)36-22-11-6-20(7-12-22)16-26(32(42)43)37-31(41)29-21-9-13-23(14-10-21)38(29)27(39)15-8-19-4-2-1-3-5-19/h1-7,11-12,17-18,21,23,26,29H,8-10,13-16H2,(H,36,40)(H,37,41)(H,42,43)/t21?,23?,26-,29-/m0/s1
n/an/a 1n/an/an/an/a7.422
Johnson & Johnson Pharmaceutical
Assay Description
Immulon 96-well plates were coated with recombinant hVCAM-1 overnight at 4 C. Plates were washed and blocked for 1 h at room temperature in PBS-BSA....
Bioorg Med Chem 13: 6693-702 (2005)
Article DOI: 10.1016/j.bmc.2005.07.022
BindingDB Entry DOI: 10.7270/Q2TD9VM1