BDBM168453 US9675593, 22
SMILES: COCCOCCOCCOc1cccc(c1)-n1cc(C)ccc1=O
InChI Key: InChIKey=BYYKTIQFXNCXAP-UHFFFAOYSA-N
Data: 1 EC50
Activity Spreadsheet -- Enzyme Inhibition Constant Data from BindingDB
Found 1 hit for monomerid = 168453
Trg + Lig
Ki
nM
ΔG°
kcal/mole
IC50
nM
Kd
nM
EC50/IC50
nM
koff
s-1
kon
M-1s-1
pHTemp
°C
Endothelin-1
(Homo sapiens (Human))
BDBM168453
(US9675593, 22)
Show SMILES COCCOCCOCCOc1cccc(c1)-n1cc(C)ccc1=O
Show InChI InChI=1S/C19H25NO5/c1-16-6-7-19(21)20(15-16)17-4-3-5-18(14-17)25-13-12-24-11-10-23-9-8-22-2/h3-7,14-15H,8-13H2,1-2H3
US Patent
n/an/an/an/a>2.00E+5n/an/an/an/a
SRMLSC
US Patent
Assay Description
Fibroblasts (primary human lung and dermal, HFL-1, 3T3 etc) are seeded in 96-well plates at ~15000 cells/well and serum starved for 0-48 hours. After...
US Patent US9675593 (2017)
BindingDB Entry DOI: 10.7270/Q2319T24